FreeBSD-main-amd64-test - Build #22723 - Still Unstable

From: <>
Date: Sun, 01 Jan 2023 01:09:38 UTC
FreeBSD-main-amd64-test - Build #22723 (231d75568f169fe6adc30373c12512b992c5c672) - Still Unstable

Build information:
Full change log:
Full build log:

Status explanation:
"Unstable" - some tests are suspected being broken by the following changes
"Still Unstable" - the failing test cases have not been fixed by these
                   following changes and this is a notification to note that
                   these changes have not been fully tested by the CI system

Change summaries:
(Those commits are likely but not certainly responsible)

45ac7755a7c5d8508176b3d015bb27ff58485c80 by kib:
amd64: identify small cores

cde70e312c3fde5b37a29be1dacb7fde9a45b94a by kib:
amd64: for small cores, use (big hammer) INVPCID_CTXGLOB instead of

231d75568f169fe6adc30373c12512b992c5c672 by kib:
Move INVLPG to pmap_quick_enter_page() from pmap_quick_remove_page().

The failed test cases:

3 tests failed.
FAILED:  sys.aio.aio_test.aio_socket_blocking_short_write

Error Message:
Test case body timed out

FAILED:  sys.aio.aio_test.aio_socket_blocking_short_write_vectored

Error Message:
Test case body timed out

FAILED:  sys.aio.aio_test.aio_socket_short_write_cancel

Error Message:
/usr/src/tests/sys/aio/aio_test.c:1396: aio_error(&iocb) == EINPROGRESS not met