FreeBSD-main-amd64-test - Build #22904 - Still Unstable

From: <>
Date: Wed, 01 Feb 2023 23:29:56 UTC
FreeBSD-main-amd64-test - Build #22904 (575e48f1c4eb05fe8df6aaeb5f55e17c63a02639) - Still Unstable

Build information:
Full change log:
Full build log:

Status explanation:
"Unstable" - some tests are suspected being broken by the following changes
"Still Unstable" - the failing test cases have not been fixed by these
                   following changes and this is a notification to note that
                   these changes have not been fully tested by the CI system

Change summaries:
(Those commits are likely but not certainly responsible)

c75ae52216771fe4de6ec8688107f5d6c20db5e8 by whu:
arm64: Hyper-V: vPCI: Fix typo and some indentations

5ebea466dc02f28573af96033f2651fc8dc04c0f by glebius:
inpcb: add myself to the copyright notice

fd53298799473575e36083c428982a4ba1a5353f by glebius:
unix: add myself to the copyright notice

575e48f1c4eb05fe8df6aaeb5f55e17c63a02639 by dchagin:
linux(4): Deduplicate MI futex structures.

The failed test cases:

3 tests failed.
FAILED:  sys.aio.aio_test.aio_socket_blocking_short_write

Error Message:
Test case body timed out

FAILED:  sys.aio.aio_test.aio_socket_blocking_short_write_vectored

Error Message:
Test case body timed out

FAILED:  sys.aio.aio_test.aio_socket_short_write_cancel

Error Message:
/usr/src/tests/sys/aio/aio_test.c:1396: aio_error(&iocb) == EINPROGRESS not met