FreeBSD-main-amd64-test - Build #22903 - Still Unstable

From: <>
Date: Wed, 01 Feb 2023 20:03:30 UTC
FreeBSD-main-amd64-test - Build #22903 (f051d72314f8eb174fe69e62a997c9ed23ff84a1) - Still Unstable

Build information:
Full change log:
Full build log:

Status explanation:
"Unstable" - some tests are suspected being broken by the following changes
"Still Unstable" - the failing test cases have not been fixed by these
                   following changes and this is a notification to note that
                   these changes have not been fully tested by the CI system

Change summaries:
(Those commits are likely but not certainly responsible)

5c32146723ef88b07506c081653898cd2f293a52 by dchagin:
amd64: Eliminate write only cpu_fxsr.

db247798c564021f216803296c07360ddbf2d5e8 by whu:
arm64: Hyper-V: vPCI: SPI MSI mapping for gic v3 acpi in arm64

6e5b082cab8d9dd0eb0bce65cf8cf268f11c7a25 by whu:
arm64: Hyper-V: vPCI: Adding Hyper-V PCI protocol 1.4

c0a4a7bb942fd3302f0093e4353820916d3661d1 by markj:
qat: Fixed Coverity reported issue

1e0853ee84031e4131a0b8cc8737696f199d3d4c by se:
sys/kbio.h: support Unicode key codes in vt keymap files

ea11861e434aab78d750545b10609ce7a7845d5d by whu:
arm64: Hyper-V: vPCI: Enabling v-PCI in FreeBSD in ARM64 Hyper-V

f051d72314f8eb174fe69e62a997c9ed23ff84a1 by imp:
hyperv: Build and install where supported

The failed test cases:

3 tests failed.
FAILED:  sys.aio.aio_test.aio_socket_blocking_short_write

Error Message:
Test case body timed out

FAILED:  sys.aio.aio_test.aio_socket_blocking_short_write_vectored

Error Message:
Test case body timed out

FAILED:  sys.aio.aio_test.aio_socket_short_write_cancel

Error Message:
/usr/src/tests/sys/aio/aio_test.c:1396: aio_error(&iocb) == EINPROGRESS not met