FreeBSD-main-amd64-test - Build #21548 - Still Unstable

From: <jenkins-admin_at_FreeBSD.org>
Date: Tue, 28 Jun 2022 14:16:20 UTC
FreeBSD-main-amd64-test - Build #21548 (8e1c23341c0c1b161f7fe9aa76ca2e399ada9f45) - Still Unstable

Build information: https://ci.FreeBSD.org/job/FreeBSD-main-amd64-test/21548/
Full change log: https://ci.FreeBSD.org/job/FreeBSD-main-amd64-test/21548/changes
Full build log: https://ci.FreeBSD.org/job/FreeBSD-main-amd64-test/21548/console

Status explanation:
"Unstable" - some tests are suspected being broken by the following changes
"Still Unstable" - the failing test cases have not been fixed by these
                   following changes and this is a notification to note that
                   these changes have not been fully tested by the CI system

Change summaries:
(Those commits are likely but not certainly responsible)

ab91feabcc6f9da21d5c75028153af16d06e679a by kp:
ovpn: Introduce OpenVPN DCO support

067acae2f3a459537001b21c28ce7311da85a1e3 by kp:
if_ovpn tests: basic test case

08926ae328d59f18a0b9674260c0f054cb3ff262 by kp:
if_ovpn tests: timeout on clients

b33308db391d74271bc3c44c31c6e4ff8f1594d0 by kp:
if_ovpn: static probe points

3d4f61350d99f2e345ff85e202c8a38c3eff957a by kp:
if_ovpn tests: tunnel over IPv6

85a15e4704e4f0a7ef6808ef8569f1458371102b by kp:
if_ovpn tests: IPv6 in IPv4 and IPv4 in IPv6 tunnels

c09e62cd910efc52dcaa25bebf1412bd1aba0b79 by kp:
if_ovpn tests: test pf's route-to

f8b1ddbfb1c0cd37b1b835cedc646deceebe0c28 by kp:
if_ovpn tests: tunnel with CHACHA20-POLY1305

2fc1fc66c7b44060246b32030aad767f9a01a49f by kp:
if_ovpn tests: Test if_ovpn when there's no route

a7a273546e389af8fab3b7d9cc6c449a2ab4f84e by kp:
if_ovpn tests: test multiple simultaneous clients

1e5ef2a7e11d5b3a4b87c34c60c414f894ccb2ce by kp:
if_ovpn tests: extend multi_client test with an iroute test

8e1c23341c0c1b161f7fe9aa76ca2e399ada9f45 by kp:
pf: reduce the risk of src/dst mis-use



The failed test cases:

40 tests failed.
FAILED:  sys.fs.fusefs.mknod.main

Error Message:
Returned non-success exit status 1

FAILED:  sys.net.routing.test_rtsock_multipath.py.TestRtmMultipath::test_rtm_multipath4[change_new_weight1]

Error Message:
Premature exit; test case exited with code 4

FAILED:  sys.net.routing.test_rtsock_multipath.py.TestRtmMultipath::test_rtm_multipath4[change_new_weight2]

Error Message:
Premature exit; test case exited with code 4

FAILED:  sys.net.routing.test_rtsock_multipath.py.TestRtmMultipath::test_rtm_multipath4[change_new_weight3]

Error Message:
Premature exit; test case exited with code 4

FAILED:  sys.net.routing.test_rtsock_multipath.py.TestRtmMultipath::test_rtm_multipath4[change_same_weight1]

Error Message:
Premature exit; test case exited with code 4

FAILED:  sys.net.routing.test_rtsock_multipath.py.TestRtmMultipath::test_rtm_multipath4[change_same_weight2]

Error Message:
Premature exit; test case exited with code 4

FAILED:  sys.net.routing.test_rtsock_multipath.py.TestRtmMultipath::test_rtm_multipath4[correctness1]

Error Message:
Premature exit; test case exited with code 4

FAILED:  sys.net.routing.test_rtsock_multipath.py.TestRtmMultipath::test_rtm_multipath4[correctness2]

Error Message:
Premature exit; test case exited with code 4

FAILED:  sys.net.routing.test_rtsock_multipath.py.TestRtmMultipath::test_rtm_multipath4[transition_multi]

Error Message:
Premature exit; test case exited with code 4

FAILED:  sys.net.routing.test_rtsock_multipath.py.TestRtmMultipath::test_rtm_multipath4[transition_single1]

Error Message:
Premature exit; test case exited with code 4

FAILED:  sys.net.routing.test_rtsock_multipath.py.TestRtmMultipath::test_rtm_multipath4[transition_single2]

Error Message:
Premature exit; test case exited with code 4

FAILED:  sys.net.routing.test_rtsock_multipath.py.TestRtmMultipath::test_rtm_multipath4[weight1]

Error Message:
Premature exit; test case exited with code 4

FAILED:  sys.net.routing.test_rtsock_multipath.py.TestRtmMultipath::test_rtm_multipath4[weight2]

Error Message:
Premature exit; test case exited with code 4

FAILED:  sys.net.routing.test_rtsock_multipath.py.TestRtmMultipath::test_rtm_multipath4[weight3_max]

Error Message:
Premature exit; test case exited with code 4

FAILED:  sys.net.routing.test_rtsock_multipath.py.TestRtmMultipath::test_rtm_multipath4_add_same_eexist

Error Message:
Premature exit; test case exited with code 4

FAILED:  sys.net.routing.test_rtsock_multipath.py.TestRtmMultipath::test_rtm_multipath4_add_zero_weight

Error Message:
Premature exit; test case exited with code 4

FAILED:  sys.net.routing.test_rtsock_multipath.py.TestRtmMultipath::test_rtm_multipath4_change_unknown_esrch

Error Message:
Premature exit; test case exited with code 4

FAILED:  sys.net.routing.test_rtsock_multipath.py.TestRtmMultipath::test_rtm_multipath4_del_unknown_esrch

Error Message:
Premature exit; test case exited with code 4

FAILED:  sys.net.routing.test_rtsock_multipath.py.TestRtmMultipath::test_rtm_multipath4_getroute

Error Message:
Premature exit; test case exited with code 4

FAILED:  sys.net.routing.test_rtsock_multipath.py.TestRtmMultipath::test_rtm_multipath6[change_new_weight1]

Error Message:
Premature exit; test case exited with code 4

FAILED:  sys.net.routing.test_rtsock_multipath.py.TestRtmMultipath::test_rtm_multipath6[change_new_weight2]

Error Message:
Premature exit; test case exited with code 4

FAILED:  sys.net.routing.test_rtsock_multipath.py.TestRtmMultipath::test_rtm_multipath6[change_new_weight3]

Error Message:
Premature exit; test case exited with code 4

FAILED:  sys.net.routing.test_rtsock_multipath.py.TestRtmMultipath::test_rtm_multipath6[change_same_weight1]

Error Message:
Premature exit; test case exited with code 4

FAILED:  sys.net.routing.test_rtsock_multipath.py.TestRtmMultipath::test_rtm_multipath6[change_same_weight2]

Error Message:
Premature exit; test case exited with code 4

FAILED:  sys.net.routing.test_rtsock_multipath.py.TestRtmMultipath::test_rtm_multipath6[correctness1]

Error Message:
Premature exit; test case exited with code 4

FAILED:  sys.net.routing.test_rtsock_multipath.py.TestRtmMultipath::test_rtm_multipath6[correctness2]

Error Message:
Premature exit; test case exited with code 4

FAILED:  sys.net.routing.test_rtsock_multipath.py.TestRtmMultipath::test_rtm_multipath6[transition_multi]

Error Message:
Premature exit; test case exited with code 4

FAILED:  sys.net.routing.test_rtsock_multipath.py.TestRtmMultipath::test_rtm_multipath6[transition_single1]

Error Message:
Premature exit; test case exited with code 4

FAILED:  sys.net.routing.test_rtsock_multipath.py.TestRtmMultipath::test_rtm_multipath6[transition_single2]

Error Message:
Premature exit; test case exited with code 4

FAILED:  sys.net.routing.test_rtsock_multipath.py.TestRtmMultipath::test_rtm_multipath6[weight1]

Error Message:
Premature exit; test case exited with code 4

FAILED:  sys.net.routing.test_rtsock_multipath.py.TestRtmMultipath::test_rtm_multipath6[weight2]

Error Message:
Premature exit; test case exited with code 4

FAILED:  sys.net.routing.test_rtsock_multipath.py.TestRtmMultipath::test_rtm_multipath6[weight3_max0]

Error Message:
Premature exit; test case exited with code 4

FAILED:  sys.net.routing.test_rtsock_multipath.py.TestRtmMultipath::test_rtm_multipath6[weight3_max1]

Error Message:
Premature exit; test case exited with code 4

FAILED:  sys.net.routing.test_rtsock_multipath.py.TestRtmMultipath::test_rtm_multipath6_add_same_eexist

Error Message:
Premature exit; test case exited with code 4

FAILED:  sys.net.routing.test_rtsock_multipath.py.TestRtmMultipath::test_rtm_multipath6_change_unknown_esrch

Error Message:
Premature exit; test case exited with code 4

FAILED:  sys.net.routing.test_rtsock_multipath.py.TestRtmMultipath::test_rtm_multipath6_del_unknown_esrch

Error Message:
Premature exit; test case exited with code 4

FAILED:  sys.net.routing.test_rtsock_multipath.py.TestRtmMultipath::test_rtm_multipath6_getroute

Error Message:
Premature exit; test case exited with code 4

FAILED:  sbin.growfs.legacy_test.main

Error Message:
6 of 19 tests failed

FAILED:  sys.geom.class.eli.resize_test.resize

Error Message:
atf-check failed; see the output of the test for details

FAILED:  usr.sbin.makefs.makefs_ffs_tests.autocalculate_image_size

Error Message:
atf-check failed; see the output of the test for details