FreeBSD-main-amd64-test - Build #21547 - Still Unstable

From: <jenkins-admin_at_FreeBSD.org>
Date: Tue, 28 Jun 2022 11:58:52 UTC
FreeBSD-main-amd64-test - Build #21547 (a25818eb2869ccc56bd711eca14cd7bbbaddd676) - Still Unstable

Build information: https://ci.FreeBSD.org/job/FreeBSD-main-amd64-test/21547/
Full change log: https://ci.FreeBSD.org/job/FreeBSD-main-amd64-test/21547/changes
Full build log: https://ci.FreeBSD.org/job/FreeBSD-main-amd64-test/21547/console

Status explanation:
"Unstable" - some tests are suspected being broken by the following changes
"Still Unstable" - the failing test cases have not been fixed by these
                   following changes and this is a notification to note that
                   these changes have not been fully tested by the CI system

Change summaries:
(Those commits are likely but not certainly responsible)

6f16d78c0da68f1e72bc6fe4c44446dbcc47a001 by kp:
pf: add missing maximum length check for DIOCADDETHRULE

fd72bfa626bcb9950eb2b057f224a7236e85e0af by kp:
pf: ensure mbufs are long enough before we copy out IP(v6) headers

07ffa50ba075d450287e22385f110e3c319470e9 by kp:
pf tests: test short packets

8e6465887373fd62d0f28c09b70272e48ae5ee2e by pho:
stress2: Update the exclude list

a25818eb2869ccc56bd711eca14cd7bbbaddd676 by pho:
stress2: Added comment about problem found



The failed test cases:

40 tests failed.
FAILED:  sys.kern.sigwait.test_wait_dequeue_sigchld_true

Error Message:
/usr/src/tests/sys/kern/sigwait.c:405: -1 != sig: sigwaitinfo() should fail, sig 20 != -1

FAILED:  sys.net.routing.test_rtsock_multipath.py.TestRtmMultipath::test_rtm_multipath4[change_new_weight1]

Error Message:
Premature exit; test case exited with code 4

FAILED:  sys.net.routing.test_rtsock_multipath.py.TestRtmMultipath::test_rtm_multipath4[change_new_weight2]

Error Message:
Premature exit; test case exited with code 4

FAILED:  sys.net.routing.test_rtsock_multipath.py.TestRtmMultipath::test_rtm_multipath4[change_new_weight3]

Error Message:
Premature exit; test case exited with code 4

FAILED:  sys.net.routing.test_rtsock_multipath.py.TestRtmMultipath::test_rtm_multipath4[change_same_weight1]

Error Message:
Premature exit; test case exited with code 4

FAILED:  sys.net.routing.test_rtsock_multipath.py.TestRtmMultipath::test_rtm_multipath4[change_same_weight2]

Error Message:
Premature exit; test case exited with code 4

FAILED:  sys.net.routing.test_rtsock_multipath.py.TestRtmMultipath::test_rtm_multipath4[correctness1]

Error Message:
Premature exit; test case exited with code 4

FAILED:  sys.net.routing.test_rtsock_multipath.py.TestRtmMultipath::test_rtm_multipath4[correctness2]

Error Message:
Premature exit; test case exited with code 4

FAILED:  sys.net.routing.test_rtsock_multipath.py.TestRtmMultipath::test_rtm_multipath4[transition_multi]

Error Message:
Premature exit; test case exited with code 4

FAILED:  sys.net.routing.test_rtsock_multipath.py.TestRtmMultipath::test_rtm_multipath4[transition_single1]

Error Message:
Premature exit; test case exited with code 4

FAILED:  sys.net.routing.test_rtsock_multipath.py.TestRtmMultipath::test_rtm_multipath4[transition_single2]

Error Message:
Premature exit; test case exited with code 4

FAILED:  sys.net.routing.test_rtsock_multipath.py.TestRtmMultipath::test_rtm_multipath4[weight1]

Error Message:
Premature exit; test case exited with code 4

FAILED:  sys.net.routing.test_rtsock_multipath.py.TestRtmMultipath::test_rtm_multipath4[weight2]

Error Message:
Premature exit; test case exited with code 4

FAILED:  sys.net.routing.test_rtsock_multipath.py.TestRtmMultipath::test_rtm_multipath4[weight3_max]

Error Message:
Premature exit; test case exited with code 4

FAILED:  sys.net.routing.test_rtsock_multipath.py.TestRtmMultipath::test_rtm_multipath4_add_same_eexist

Error Message:
Premature exit; test case exited with code 4

FAILED:  sys.net.routing.test_rtsock_multipath.py.TestRtmMultipath::test_rtm_multipath4_add_zero_weight

Error Message:
Premature exit; test case exited with code 4

FAILED:  sys.net.routing.test_rtsock_multipath.py.TestRtmMultipath::test_rtm_multipath4_change_unknown_esrch

Error Message:
Premature exit; test case exited with code 4

FAILED:  sys.net.routing.test_rtsock_multipath.py.TestRtmMultipath::test_rtm_multipath4_del_unknown_esrch

Error Message:
Premature exit; test case exited with code 4

FAILED:  sys.net.routing.test_rtsock_multipath.py.TestRtmMultipath::test_rtm_multipath4_getroute

Error Message:
Premature exit; test case exited with code 4

FAILED:  sys.net.routing.test_rtsock_multipath.py.TestRtmMultipath::test_rtm_multipath6[change_new_weight1]

Error Message:
Premature exit; test case exited with code 4

FAILED:  sys.net.routing.test_rtsock_multipath.py.TestRtmMultipath::test_rtm_multipath6[change_new_weight2]

Error Message:
Premature exit; test case exited with code 4

FAILED:  sys.net.routing.test_rtsock_multipath.py.TestRtmMultipath::test_rtm_multipath6[change_new_weight3]

Error Message:
Premature exit; test case exited with code 4

FAILED:  sys.net.routing.test_rtsock_multipath.py.TestRtmMultipath::test_rtm_multipath6[change_same_weight1]

Error Message:
Premature exit; test case exited with code 4

FAILED:  sys.net.routing.test_rtsock_multipath.py.TestRtmMultipath::test_rtm_multipath6[change_same_weight2]

Error Message:
Premature exit; test case exited with code 4

FAILED:  sys.net.routing.test_rtsock_multipath.py.TestRtmMultipath::test_rtm_multipath6[correctness1]

Error Message:
Premature exit; test case exited with code 4

FAILED:  sys.net.routing.test_rtsock_multipath.py.TestRtmMultipath::test_rtm_multipath6[correctness2]

Error Message:
Premature exit; test case exited with code 4

FAILED:  sys.net.routing.test_rtsock_multipath.py.TestRtmMultipath::test_rtm_multipath6[transition_multi]

Error Message:
Premature exit; test case exited with code 4

FAILED:  sys.net.routing.test_rtsock_multipath.py.TestRtmMultipath::test_rtm_multipath6[transition_single1]

Error Message:
Premature exit; test case exited with code 4

FAILED:  sys.net.routing.test_rtsock_multipath.py.TestRtmMultipath::test_rtm_multipath6[transition_single2]

Error Message:
Premature exit; test case exited with code 4

FAILED:  sys.net.routing.test_rtsock_multipath.py.TestRtmMultipath::test_rtm_multipath6[weight1]

Error Message:
Premature exit; test case exited with code 4

FAILED:  sys.net.routing.test_rtsock_multipath.py.TestRtmMultipath::test_rtm_multipath6[weight2]

Error Message:
Premature exit; test case exited with code 4

FAILED:  sys.net.routing.test_rtsock_multipath.py.TestRtmMultipath::test_rtm_multipath6[weight3_max0]

Error Message:
Premature exit; test case exited with code 4

FAILED:  sys.net.routing.test_rtsock_multipath.py.TestRtmMultipath::test_rtm_multipath6[weight3_max1]

Error Message:
Premature exit; test case exited with code 4

FAILED:  sys.net.routing.test_rtsock_multipath.py.TestRtmMultipath::test_rtm_multipath6_add_same_eexist

Error Message:
Premature exit; test case exited with code 4

FAILED:  sys.net.routing.test_rtsock_multipath.py.TestRtmMultipath::test_rtm_multipath6_change_unknown_esrch

Error Message:
Premature exit; test case exited with code 4

FAILED:  sys.net.routing.test_rtsock_multipath.py.TestRtmMultipath::test_rtm_multipath6_del_unknown_esrch

Error Message:
Premature exit; test case exited with code 4

FAILED:  sys.net.routing.test_rtsock_multipath.py.TestRtmMultipath::test_rtm_multipath6_getroute

Error Message:
Premature exit; test case exited with code 4

FAILED:  sbin.growfs.legacy_test.main

Error Message:
6 of 19 tests failed

FAILED:  sys.geom.class.eli.resize_test.resize

Error Message:
atf-check failed; see the output of the test for details

FAILED:  usr.sbin.makefs.makefs_ffs_tests.autocalculate_image_size

Error Message:
atf-check failed; see the output of the test for details