FreeBSD-main-amd64-test - Build #21524 - Still Unstable

From: <>
Date: Sat, 25 Jun 2022 23:19:02 UTC
FreeBSD-main-amd64-test - Build #21524 (9a75209d2bdcdc040a865c48d555f95740568373) - Still Unstable

Build information:
Full change log:
Full build log:

Status explanation:
"Unstable" - some tests are suspected being broken by the following changes
"Still Unstable" - the failing test cases have not been fixed by these
                   following changes and this is a notification to note that
                   these changes have not been fully tested by the CI system

Change summaries:
(Those commits are likely but not certainly responsible)

c38da70c28a886cc31a2f009baa79deb7fceec88 by melifaro:
routing: fix RTM_CHANGE nhgroup updates.

8eb2bee6c0f4957c6c1cea826e59cda4d18a2a64 by melifaro:
testing: Add basic atf support to pytest.

bd03f10a6018a68cb1800f6db01b7552c39784bb by melifaro:
routing: add multipath pytest tests

c260d5cd8e364ad448ba714d9f851976c6f8da51 by melifaro:
routing: fix crash when RTM_CHANGE results in no-op for the multipath

6fa8ed43ee0ca43cf170f52b57fcad562f97baba by melifaro:
routing: improve debugging.

9a75209d2bdcdc040a865c48d555f95740568373 by melifaro:
routing: add tests/sys/net/routing to mtree

The failed test cases:

4 tests failed.

Error Message:
Cannot find test program

FAILED:  sbin.growfs.legacy_test.main

Error Message:
6 of 19 tests failed

FAILED:  sys.geom.class.eli.resize_test.resize

Error Message:
atf-check failed; see the output of the test for details

FAILED:  usr.sbin.makefs.makefs_ffs_tests.autocalculate_image_size

Error Message:
atf-check failed; see the output of the test for details