FreeBSD-main-amd64-test - Build #21523 - Still Unstable

From: <jenkins-admin_at_FreeBSD.org>
Date: Sat, 25 Jun 2022 12:24:07 UTC
FreeBSD-main-amd64-test - Build #21523 (2c28cd09d9f7ac266a8c7b283384712aba0af93a) - Still Unstable

Build information: https://ci.FreeBSD.org/job/FreeBSD-main-amd64-test/21523/
Full change log: https://ci.FreeBSD.org/job/FreeBSD-main-amd64-test/21523/changes
Full build log: https://ci.FreeBSD.org/job/FreeBSD-main-amd64-test/21523/console

Status explanation:
"Unstable" - some tests are suspected being broken by the following changes
"Still Unstable" - the failing test cases have not been fixed by these
                   following changes and this is a notification to note that
                   these changes have not been fully tested by the CI system

Change summaries:
(Those commits are likely but not certainly responsible)

6c4b6f55f77d8d7cee1b277bd6579a77d6890ef9 by hselasky:
busdma: Protect ARM busdma bounce page counters using the bounce page

2c28cd09d9f7ac266a8c7b283384712aba0af93a by hselasky:
cuse(3): Remove PAGE_SIZE from libcuse.



The failed test cases:

3 tests failed.
FAILED:  sbin.growfs.legacy_test.main

Error Message:
6 of 19 tests failed

FAILED:  sys.geom.class.eli.resize_test.resize

Error Message:
atf-check failed; see the output of the test for details

FAILED:  usr.sbin.makefs.makefs_ffs_tests.autocalculate_image_size

Error Message:
atf-check failed; see the output of the test for details