FreeBSD-main-amd64-test - Build #22712 - Still Unstable

From: <>
Date: Wed, 28 Dec 2022 22:18:23 UTC
FreeBSD-main-amd64-test - Build #22712 (d131218534977f1b2ed590380e70d59a3b20b333) - Still Unstable

Build information:
Full change log:
Full build log:

Status explanation:
"Unstable" - some tests are suspected being broken by the following changes
"Still Unstable" - the failing test cases have not been fixed by these
                   following changes and this is a notification to note that
                   these changes have not been fully tested by the CI system

Change summaries:
(Those commits are likely but not certainly responsible)

058ac3e8063366dafa634d9107642e12b038bf09 by melifaro:
atf_pytest_wrapper: fix pytest output truncation

d131218534977f1b2ed590380e70d59a3b20b333 by jhb:
h_resolv: Fix a buffer overflow in load().

The failed test cases:

4 tests failed.
FAILED:  sys.netinet6.proxy_ndp.pndp_neighbor_advert

Error Message:
atf-check failed; see the output of the test for details

FAILED:  sys.aio.aio_test.aio_socket_blocking_short_write

Error Message:
Test case body timed out

FAILED:  sys.aio.aio_test.aio_socket_blocking_short_write_vectored

Error Message:
Test case body timed out

FAILED:  sys.aio.aio_test.aio_socket_short_write_cancel

Error Message:
/usr/src/tests/sys/aio/aio_test.c:1396: aio_error(&iocb) == EINPROGRESS not met