FreeBSD-main-amd64-test - Build #22711 - Still Unstable

From: <>
Date: Wed, 28 Dec 2022 19:13:55 UTC
FreeBSD-main-amd64-test - Build #22711 (eaeebfcb38599c94e89bbba3e9c7aeb821c84d71) - Still Unstable

Build information:
Full change log:
Full build log:

Status explanation:
"Unstable" - some tests are suspected being broken by the following changes
"Still Unstable" - the failing test cases have not been fixed by these
                   following changes and this is a notification to note that
                   these changes have not been fully tested by the CI system

Change summaries:
(Those commits are likely but not certainly responsible)

f948cb717f50f3f53e0f76d9eb2bd36bc278cb3b by zlei:

bd5d9037c5dd79390faf8ee37eecd99e1c378bf0 by zlei:
GEOM: Remove redundant NULL pointer check before g_free()

eaeebfcb38599c94e89bbba3e9c7aeb821c84d71 by melifaro:
pytest: silence deprecation warning in the pytest atf wrapper

The failed test cases:

3 tests failed.
FAILED:  sys.aio.aio_test.aio_socket_blocking_short_write

Error Message:
Test case body timed out

FAILED:  sys.aio.aio_test.aio_socket_blocking_short_write_vectored

Error Message:
Test case body timed out

FAILED:  sys.aio.aio_test.aio_socket_short_write_cancel

Error Message:
/usr/src/tests/sys/aio/aio_test.c:1396: aio_error(&iocb) == EINPROGRESS not met