FreeBSD-main-amd64-test - Build #22706 - Still Unstable

From: <>
Date: Tue, 27 Dec 2022 01:02:19 UTC
FreeBSD-main-amd64-test - Build #22706 (b079ca8593edb24fec69fc1d9749c014db4384c3) - Still Unstable

Build information:
Full change log:
Full build log:

Status explanation:
"Unstable" - some tests are suspected being broken by the following changes
"Still Unstable" - the failing test cases have not been fixed by these
                   following changes and this is a notification to note that
                   these changes have not been fully tested by the CI system

Change summaries:
(Those commits are likely but not certainly responsible)

5e4ae3061f27039ccc13b4d08004bdaf369f291c by glebius:
tests/divert: use PF_DIVERT

b079ca8593edb24fec69fc1d9749c014db4384c3 by kp:
Revert "if_ovpn: allow peer lookup by vpn4/vpn6 address"

The failed test cases:

3 tests failed.
FAILED:  sys.aio.aio_test.aio_socket_blocking_short_write

Error Message:
Test case body timed out

FAILED:  sys.aio.aio_test.aio_socket_blocking_short_write_vectored

Error Message:
Test case body timed out

FAILED:  sys.aio.aio_test.aio_socket_short_write_cancel

Error Message:
/usr/src/tests/sys/aio/aio_test.c:1396: aio_error(&iocb) == EINPROGRESS not met