FreeBSD-main-amd64-test - Build #22705 - Still Unstable

From: <>
Date: Mon, 26 Dec 2022 22:43:45 UTC
FreeBSD-main-amd64-test - Build #22705 (829f0bcb5fe24bb523c5a9e7bd3bb79412e06906) - Still Unstable

Build information:
Full change log:
Full build log:

Status explanation:
"Unstable" - some tests are suspected being broken by the following changes
"Still Unstable" - the failing test cases have not been fixed by these
                   following changes and this is a notification to note that
                   these changes have not been fully tested by the CI system

Change summaries:
(Those commits are likely but not certainly responsible)

94267fc9077497bc2d70466f9e91d5b6eabb37a2 by mjg:
vfs: use designated initializers for the typename array

ed1bb254101ec3107d00257209204f8497fb0c1e by mjg:
mntfs: change mntfs_allocvp API to relock on its own

829f0bcb5fe24bb523c5a9e7bd3bb79412e06906 by mjg:
vfs: add the concept of vnode state transitions

The failed test cases:

4 tests failed.

Error Message:
atf-check failed; see the output of the test for details

FAILED:  sys.aio.aio_test.aio_socket_blocking_short_write

Error Message:
Test case body timed out

FAILED:  sys.aio.aio_test.aio_socket_blocking_short_write_vectored

Error Message:
Test case body timed out

FAILED:  sys.aio.aio_test.aio_socket_short_write_cancel

Error Message:
/usr/src/tests/sys/aio/aio_test.c:1396: aio_error(&iocb) == EINPROGRESS not met