FreeBSD-main-amd64-test - Build #22658 - Still Unstable

From: <>
Date: Sat, 17 Dec 2022 22:32:19 UTC
FreeBSD-main-amd64-test - Build #22658 (38389acc59fcb014c5c9beed06a6f13835808b89) - Still Unstable

Build information:
Full change log:
Full build log:

Status explanation:
"Unstable" - some tests are suspected being broken by the following changes
"Still Unstable" - the failing test cases have not been fixed by these
                   following changes and this is a notification to note that
                   these changes have not been fully tested by the CI system

Change summaries:
(Those commits are likely but not certainly responsible)

38389acc59fcb014c5c9beed06a6f13835808b89 by pfg:
ext2fs: fix potential memory leak in ext4_ext_grow_indepth()

The failed test cases:

4 tests failed.
FAILED:  sys.netpfil.common.pass_block.pf_v6

Error Message:
atf-check failed; see the output of the test for details

FAILED:  sys.aio.aio_test.aio_socket_blocking_short_write

Error Message:
Test case body timed out

FAILED:  sys.aio.aio_test.aio_socket_blocking_short_write_vectored

Error Message:
Test case body timed out

FAILED:  sys.aio.aio_test.aio_socket_short_write_cancel

Error Message:
/usr/src/tests/sys/aio/aio_test.c:1396: aio_error(&iocb) == EINPROGRESS not met