FreeBSD-main-amd64-test - Build #22657 - Still Unstable

From: <>
Date: Sat, 17 Dec 2022 20:08:12 UTC
FreeBSD-main-amd64-test - Build #22657 (4d903a1a74d9526aba4d177e89c10f97df5662f2) - Still Unstable

Build information:
Full change log:
Full build log:

Status explanation:
"Unstable" - some tests are suspected being broken by the following changes
"Still Unstable" - the failing test cases have not been fixed by these
                   following changes and this is a notification to note that
                   these changes have not been fully tested by the CI system

Change summaries:
(Those commits are likely but not certainly responsible)

3249449190c2c71ecfc4fa5f518f94ff552df440 by kib:
vm_page_grab_valid(): clear *mp in case of pager denying page allocation

4d903a1a74d9526aba4d177e89c10f97df5662f2 by kib:
tmpfs_getattr(): Only take vm_object lock on 32bit machines

The failed test cases:

3 tests failed.
FAILED:  sys.aio.aio_test.aio_socket_blocking_short_write

Error Message:
Test case body timed out

FAILED:  sys.aio.aio_test.aio_socket_blocking_short_write_vectored

Error Message:
Test case body timed out

FAILED:  sys.aio.aio_test.aio_socket_short_write_cancel

Error Message:
/usr/src/tests/sys/aio/aio_test.c:1396: aio_error(&iocb) == EINPROGRESS not met