FreeBSD-main-amd64-test - Build #22655 - Still Unstable

From: <>
Date: Sat, 17 Dec 2022 02:10:21 UTC
FreeBSD-main-amd64-test - Build #22655 (195f1b124da4bf73d951cd251dffd9485672fe0a) - Still Unstable

Build information:
Full change log:
Full build log:

Status explanation:
"Unstable" - some tests are suspected being broken by the following changes
"Still Unstable" - the failing test cases have not been fixed by these
                   following changes and this is a notification to note that
                   these changes have not been fully tested by the CI system

Change summaries:
(Those commits are likely but not certainly responsible)

195f1b124da4bf73d951cd251dffd9485672fe0a by rmacklem:
vfs_mount.c: fix vfs_domount() for PRIV_VFS_MOUNT_EXPORTED

The failed test cases:

4 tests failed.
FAILED:  sys.netinet6.lpm6.lpm6_test2_success

Error Message:
atf-check failed; see the output of the test for details

FAILED:  sys.aio.aio_test.aio_socket_blocking_short_write

Error Message:
Test case body timed out

FAILED:  sys.aio.aio_test.aio_socket_blocking_short_write_vectored

Error Message:
Test case body timed out

FAILED:  sys.aio.aio_test.aio_socket_short_write_cancel

Error Message:
/usr/src/tests/sys/aio/aio_test.c:1396: aio_error(&iocb) == EINPROGRESS not met