FreeBSD-main-amd64-test - Build #22654 - Still Unstable

From: <>
Date: Fri, 16 Dec 2022 23:09:36 UTC
FreeBSD-main-amd64-test - Build #22654 (8fb9739615da8922fbd8988ccd77093d4ca335ba) - Still Unstable

Build information:
Full change log:
Full build log:

Status explanation:
"Unstable" - some tests are suspected being broken by the following changes
"Still Unstable" - the failing test cases have not been fixed by these
                   following changes and this is a notification to note that
                   these changes have not been fully tested by the CI system

Change summaries:
(Those commits are likely but not certainly responsible)

8fb9739615da8922fbd8988ccd77093d4ca335ba by jhb:
wg: Re-add basic if_wg(4) tests.

The failed test cases:

3 tests failed.
FAILED:  sys.aio.aio_test.aio_socket_blocking_short_write

Error Message:
Test case body timed out

FAILED:  sys.aio.aio_test.aio_socket_blocking_short_write_vectored

Error Message:
Test case body timed out

FAILED:  sys.aio.aio_test.aio_socket_short_write_cancel

Error Message:
/usr/src/tests/sys/aio/aio_test.c:1396: aio_error(&iocb) == EINPROGRESS not met