FreeBSD-main-amd64-test - Build #19887 - Still Unstable

From: <>
Date: Wed, 24 Nov 2021 11:46:42 UTC
FreeBSD-main-amd64-test - Build #19887 (a2b53e53a3f38dd89b64500a2d2a1727baffe4f9) - Still Unstable

Build information:
Full change log:
Full build log:

Status explanation:
"Unstable" - some tests are suspected being broken by the following changes
"Still Unstable" - the failing test cases have not been fixed by these
                   following changes and this is a notification to note that
                   these changes have not been fully tested by the CI system

Change summaries:
(Those commits are likely but not certainly responsible)

1bc9ca3b35d280cdb0dbefa69bebf687970d1ef6 by imp:
cam: Unbreak CAM_IO_STATS build

b3fab418301eaadb3b9ac24f9ff295a84521dc54 by imp:
devctl.h: Spelling typo

a2b53e53a3f38dd89b64500a2d2a1727baffe4f9 by imp:
sys/file.h: Allow inclusion when compiling for a strict namespace

The failed test cases:

3 tests failed.
FAILED:  lib.libregex.exhaust_test.regcomp_too_big

Error Message:
Empty test result or no new line

FAILED:  sys.netpfil.common.dummynet.ipfw_queue

Error Message:
We failed prioritisation 2 times

FAILED:  lib.libc.sys.setrlimit_test.setrlimit_stack

Error Message:
Empty test result or no new line