11.1-BETA1: lsof build failure

Larry Rosenman ler at lerctr.org
Wed Jun 14 13:37:24 UTC 2017

Current lsof is 4.90M. 

Sysutils/lsof maintainer

On 6/14/17, 8:13 AM, "Peter" <owner-freebsd-stable at freebsd.org on behalf of pmc at citylink.dinoex.sub.org> wrote:

    FYI, please check if reproducible and/or issue:
    Installed this from SVN & local build:
    11.1-BETA1 FreeBSD 11.1-BETA1 #0 r319858:319867M ... amd64
    Then tried to update lsof-4.90.f,8 and got this error:
    -DHASUTMPX -DHAS_STRFTIME -DLSOF_VSTR="11.1-BETA1" -I/usr/src/sys -O2 -c 
    dvch.c -o dvch.o
    --- dnode.o ---
    dnode.c:906:13: error: no member named 'i_dev' in 'struct inode'
                 if (i->i_dev
                     ~  ^
    dnode.c:916:27: error: no member named 'i_dev' in 'struct inode'
                     dev = Dev2Udev((KA_T)i->i_dev);
                                          ~  ^
    2 errors generated.
    *** [dnode.o] Error code 1
    freebsd-stable at freebsd.org mailing list
    To unsubscribe, send any mail to "freebsd-stable-unsubscribe at freebsd.org"

More information about the freebsd-stable mailing list