9.2 latest llvm upgrade does not compile [solved]

Jens Jahnke jan0sch at gmx.net
Tue Nov 5 20:30:01 UTC 2013

On Thu, 31 Oct 2013 11:56:48 +0100
Jens Jahnke <jan0sch at gmx.net> wrote:

JJ> the recent update for clang and llvm (3.3) does not compile on my
JJ> main machine. I'm using 9.2 (updated from 9.1) and ports/portmaster.
JJ> Error message:
JJ> gmake[3]: Leaving directory
JJ> `/usr/ports/devel/llvm33/work/llvm-3.3.src/projects/sample/tools'
JJ> File "/usr/local/bin/sphinx-build", line 5, in <module> from
JJ> pkg_resources import load_entry_point File
JJ> "build/bdist.freebsd-9.2-RELEASE-amd64/egg/pkg_resources.py", line
JJ> 2805, in <module> File
JJ> "build/bdist.freebsd-9.2-RELEASE-amd64/egg/pkg_resources.py", line
JJ> 696, in require File
JJ> "build/bdist.freebsd-9.2-RELEASE-amd64/egg/pkg_resources.py", line
JJ> 594, in resolve pkg_resources.DistributionNotFound: markupsafe
JJ> gmake: *** [man] Error 1 *** [post-build] Error code 2
JJ> Stop in /usr/ports/devel/llvm33.
JJ> *** [build] Error code 1

Just in case someone stumbles upon this error. I was able to solve it
the following way:

1. deinstalled all python packages
2. reinstalled python 2.7
3. reinstalled previous py-packages
4. pip install Jinja2
5. reinstalled textproc/py-sphinx

Afterwards I was able to compile llvm and clang updates.



05. Nebelung 2013, 21:27
Homepage : http://www.jan0sch.de

That, that is, is.
That, that is not, is not.
That, that is, is not that, that is not.
That, that is not, is not that, that is.
-------------- next part --------------
A non-text attachment was scrubbed...
Name: not available
Type: application/pgp-signature
Size: 704 bytes
Desc: not available
URL: <http://lists.freebsd.org/pipermail/freebsd-questions/attachments/20131105/63476937/attachment.sig>

More information about the freebsd-questions mailing list