Still unable to update kdelibs3

Carmel carmel_ny at
Sat Mar 13 15:31:42 UTC 2010

I have tried everything in the "UPDATING" file; however, I am still
unable to get 'kdelibs3' updated. It always ends with this error

Making all in dnssd
gmake[2]: Entering directory `/usr/ports/x11/kdelibs3/work/kdelibs-3.5.10/dnssd'
../kdecore/kconfig_compiler/kconfig_compiler ./kcm_kdnssd.kcfg ./settings.kcfgc; ret=$?; \
	if test "$ret" != 0; then rm -f settings.h ; exit $ret ;  fi
/libexec/ Shared object "" not found, required by ""
gmake[2]: *** [settings.h] Error 1
gmake[2]: Leaving directory `/usr/ports/x11/kdelibs3/work/kdelibs-3.5.10/dnssd'
gmake[1]: *** [all-recursive] Error 1
gmake[1]: Leaving directory `/usr/ports/x11/kdelibs3/work/kdelibs-3.5.10'
gmake: *** [all] Error 2
*** Error code 1

Other than deleting everything and starting over, I have no idea how to


carmel_ny at


The universe is ruled by letting things take their course.
It cannot be ruled by interfering.

	Chinese proverb

More information about the freebsd-questions mailing list