Unable to build kdelibs3

Carmel carmel_ny at hotmail.com
Wed Feb 17 23:38:13 UTC 2010

I am still having a problem getting kdelibs3 to build on my FreeBSD-7.2
system. I believe I have followed all of the directions in the UPDATING
file. Unfortunately, the build always ends like this:

Making all in dnssd
gmake[2]: Entering directory `/usr/ports/x11/kdelibs3/work/kdelibs-3.5.10/dnssd'
../kdecore/kconfig_compiler/kconfig_compiler ./kcm_kdnssd.kcfg ./settings.kcfgc; ret=$?; \
	if test "$ret" != 0; then rm -f settings.h ; exit $ret ;  fi
/libexec/ld-elf.so.1: Shared object "libjpeg.so.10" not found, required by "libkdefx.so.6"
gmake[2]: *** [settings.h] Error 1
gmake[2]: Leaving directory `/usr/ports/x11/kdelibs3/work/kdelibs-3.5.10/dnssd'
gmake[1]: *** [all-recursive] Error 1
gmake[1]: Leaving directory `/usr/ports/x11/kdelibs3/work/kdelibs-3.5.10'
gmake: *** [all] Error 2
*** Error code 1

Stop in /usr/ports/x11/kdelibs3.

carmel_ny at hotmail.com


Never eat more than you can lift.

	Miss Piggy

More information about the freebsd-questions mailing list