GTK Compile fail in 7.0-R

chris at chris at
Thu Mar 6 17:45:32 UTC 2008

I have tried to re-build all of my ports, but gtk-2 is failing.  Any

the comand I used last was:

portupgrade -Rf --batch gtk-2.12.3  > gtk.immodules
/libexec/ Shared object "" not found, required by
gmake[3]: *** [gtk.immodules] Error 1
gmake[3]: Leaving directory
gmake[2]: *** [all-recursive] Error 1
gmake[2]: Leaving directory
gmake[1]: *** [all-recursive] Error 1
gmake[1]: Leaving directory `/usr/ports/x11-toolkits/gtk20/work/gtk+-2.12.8'
gmake: *** [all] Error 2
** Command failed [exit code 1]: /usr/bin/script -qa
/tmp/portupgrade.13565.39 env UPGRADE_TOOL=portupgrade
UPGRADE_PORT=gtk-2.12.3 UPGRADE_PORT_VER=2.12.3 make BATCH=yes
** Fix the problem and try again.
** Listing the failed packages (-:ignored / *:skipped / !:failed)
        ! x11-toolkits/gtk20 (gtk-2.12.3)       (new compiler error)

More information about the freebsd-questions mailing list