Nightmares installing kde-3.5.5

Odhiambo Washington wash at
Mon Jan 1 03:17:31 PST 2007

Bon Anee!

I have been trying to install kde-3.5.5 onto my box for 4 days now 
without success. I have even wiped out 3.5.3 (which is what I was 
running before) but still 3.5.5 wouldn't install. The problem is 
somewhere around kdelibs3 and cups but I cannot figure out how to go 
around it.
I'd appreciate some help on what I need to do. I'd like to start the new 
year with brand new kde!

Here is where it fails:

gmake[4]: Leaving directory `/usr/ports/x11/kdelibs3/work/kdelibs-3.5.5/kdeprint/cups/cupsdconf2'
gmake[4]: Entering directory `/usr/ports/x11/kdelibs3/work/kdelibs-3.5.5/kdeprint/cups'
if /bin/sh /usr/local/bin/libtool --silent --tag=CXX --mode=compile c++ -DHAVE_CONFIG_H -I. -I. -I../.. -I../../dcop -I../../kdecore -I../../kio/
kssl -I../../kjs -I../.. -I../../kio -I../../kfile -I../../kdeprint -I../../kdeprint/management -I../../kdecore/network -I../../dcop -I../../libl
tdl -I../../kdefx -I../../kdecore -I../../kdecore -I../../kdecore/network -I../../kdeui -I../../kio -I../../kio/kio -I../../kio/kfile -I../..  -I
/usr/X11R6/include -I/usr/local/include -I/usr/local/include -D_KDEPRINT_COMPILE -D_THREAD_SAFE -pthread -DQT_THREAD_SUPPORT   -I/usr/local/inclu
de -I/usr/local/include  -I/usr/X11R6/include -D_GETOPT_H -D_THREAD_SAFE   -Wno-long-long -Wundef -Wall -W -Wpointer-arith -DNDEBUG -DNO_DEBUG -O
2 -O2 -fno-strict-aliasing -pipe -Wno-non-virtual-dtor -fno-exceptions -fno-check-new -fno-common  -DQT_CLEAN_NAMESPACE -DQT_NO_ASCII_CAST -DQT_N
O_STL -DQT_NO_COMPAT -DQT_NO_TRANSLATION  -MT ipprequest.lo -MD -MP -MF ".deps/ipprequest.Tpo" -c -o ipprequest.lo ipprequest.cpp; \
then mv -f ".deps/ipprequest.Tpo" ".deps/ipprequest.Plo"; else rm -f ".deps/ipprequest.Tpo"; exit 1; fi
ipprequest.cpp: In static member function `static QString IppRequest::assembleURI(const QString&, int, const QString&)':
ipprequest.cpp:573: error: incomplete type `KURL' used in nested name specifier
ipprequest.cpp:577: error: incomplete type `KURL' used in nested name specifier
gmake[4]: *** [ipprequest.lo] Error 1
gmake[4]: Leaving directory `/usr/ports/x11/kdelibs3/work/kdelibs-3.5.5/kdeprint/cups'
gmake[3]: *** [all-recursive] Error 1
gmake[3]: Leaving directory `/usr/ports/x11/kdelibs3/work/kdelibs-3.5.5/kdeprint/cups'
gmake[2]: *** [all-recursive] Error 1
gmake[2]: Leaving directory `/usr/ports/x11/kdelibs3/work/kdelibs-3.5.5/kdeprint'
gmake[1]: *** [all-recursive] Error 1
gmake[1]: Leaving directory `/usr/ports/x11/kdelibs3/work/kdelibs-3.5.5'
gmake: *** [all] Error 2
*** Error code 2

Stop in /usr/ports/x11/kdelibs3.
*** Error code 1

Stop in /usr/ports/x11/kdebase3.
*** Error code 1



    |\      _,,,---,,_     | Odhiambo Washington    <wash at>
Zzz /,`.-'`'    -.  ;-;;,_ | Wananchi Online Ltd.
   |,4-  ) )-,_. ,\ (  `'-'| Tel: +254 20 313985-9  +254 20 313922
  '---''(_/--'  `-'\_)     | GSM: +254 722 743223   +254 733 744121

	No violence, gentlemen -- no violence, I beg of you! Consider
the furniture!
		-- Sherlock Holmes

More information about the freebsd-questions mailing list