error while installing port graphics/librsvg2

Cristian Sirbu cristiansirbu at
Thu Jun 9 15:25:39 GMT 2005

I'm having an error in the 'install' phase of the
port. It builds without errors.
I updated each and every dependancy this port has to
the latest version as of 09 June 2005 (today).

The part of the log that contains the error is below.
Should the full build and install log be necesary i
can provide it.

gmake  install-data-hook
gmake[3]: Entering directory
if [ -z "" ] ; then \
  /bin/sh ../mkinstalldirs /usr/X11R6/etc/gtk-2.0 ; \
  /usr/X11R6/bin/gdk-pixbuf-query-loaders >
/usr/X11R6/etc/gtk-2.0/gdk-pixbuf.loaders ; \
/usr/local/lib/ Undefined symbol
gmake[3]: *** [install-data-hook] Error 1
gmake[3]: Leaving directory
gmake[2]: *** [install-data-am] Error 2
gmake[2]: Leaving directory
gmake[1]: *** [install-am] Error 2
gmake[1]: Leaving directory
gmake: *** [install-recursive] Error 1
*** Error code 2

Stop in /usr/ports/graphics/librsvg2.

Thanks in advance for any thoughts or solutions.

Discover Yahoo! 
Have fun online with music videos, cool games, IM and more. Check it out!

More information about the freebsd-questions mailing list