gnome-applets-2.2.2 build fails

Jukka Huvinen jhuvinen at
Fri May 30 23:55:10 PDT 2003

I'm still trying to portupgrade to the current XFree86 + gdm2 + gnome2.
Managed to complete XFree86 and gdm2 (at least portupgrade passed

But gnome2 fails when building gnome-applets! (The package is not
available and forced to build from sources.)

It requires, but there is only in /usr/lib
(See below...)

What should I do? Help!

- Jukka


cc -O -pipe -o multiload-applet-2 cpuload.o linux-proc.o load-graph.o
loadavg.o main.o memload.o netload.o properties.o swapload.o
-Wl,--export-dynamic -pthread  -L/usr/local/lib
../screen-exec/.libs/ -L/usr/X11R6/lib -lpanel-applet-2
-lgnomeui-2 -lSM -lICE -lbonoboui-2 -lxml2 -lgnomecanvas-2 -lgnome-2
-lart_lgpl_2 -lpangoft2-1.0 -lgtk-x11-2.0 -lgdk-x11-2.0 -lXinerama
-latk-1.0 -lgdk_pixbuf-2.0 -lpangoxft-1.0 -lXft -lfreetype -lz -lXext
-lXrender -lfontconfig -lpangox-1.0 -lX11 -lpango-1.0 -lbonobo-2
-lgconf-2 -lgnomevfs-2 -lbonobo-activation -lORBit-2 -lm -llinc
-lgmodule-2.0 -lgobject-2.0 -lgthread-2.0 -lgtop-2.0 -lgtop_sysdeps-2.0
-lgtop_common-2.0 -lglib-2.0 -liconv
/usr/libexec/elf/ld: warning:, needed by
/usr/X11R6/lib/, not found (try using -rpath or -rpath-link)
/usr/local/lib/ undefined reference to `statvfs'
gmake[2]: *** [multiload-applet-2] Error 1
gmake[2]: Leaving directory
gmake[1]: *** [all-recursive] Error 1
gmake[1]: Leaving directory
gmake: *** [all-recursive-am] Error 2
*** Error code 2

Stop in /usr/ports/x11/gnomeapplets2.
--->  Skipping 'x11/gnome2' (gnome2-2.2.1_1) because 'x11/gnomeapplets2'
(gnomeapplets2-2.2.0_1) failed
	! x11/gnomeapplets2 (gnomeapplets2-2.2.0_1)	(new compiler error)
	* x11/gnome2 (gnome2-2.2.1_1)


More information about the freebsd-questions mailing list