Jos Chrispijn ports at
Wed Nov 19 20:43:46 UTC 2014

   Dear port maintainer,
   Just ran into an update issue with the ClamAV port:
   --- cut ---
   ../libclamav/others.h:317: error: expected specifier-qualifier-list
   before 'clcb_file_props'
   ../libclamav/others.h:388: error: expected specifier-qualifier-list
   before 'clcb_file_props'
   ../shared/cdiff.c: In function 'cdiff_apply':
   ../shared/cdiff.c:781: error: 'EVP_MD_CTX' undeclared (first use in
   this function)
   ../shared/cdiff.c:781: error: (Each undeclared identifier is reported
   only once
   ../shared/cdiff.c:781: error: for each function it appears in.)
   ../shared/cdiff.c:781: error: 'sha256ctx' undeclared (first use in this
   Makefile:685: recipe for target 'cdiff.o' failed
   gmake[2]: *** [cdiff.o] Error 1
   gmake[2]: *** Waiting for unfinished jobs....
   gmake[2]: Leaving directory
   Makefile:717: recipe for target 'all-recursive' failed
   gmake[1]: *** [all-recursive] Error 1
   gmake[1]: Leaving directory
   Makefile:545: recipe for target 'all' failed
   gmake: *** [all] Error 2
   ===> Compilation failed unexpectedly.
   Try to set MAKE_JOBS_UNSAFE=yes and rebuild before reporting the
   failure to
   the maintainer.
   *** [do-build] Error code 1
   Stop in /usr/ports/security/clamav.
   *** [build] Error code 1
   Stop in /usr/ports/security/clamav.
   ===>>> make build failed for security/clamav
   ===>>> Aborting update
   ===>>> Update for security/clamav failed
   ===>>> Aborting update
   --- end ---
   Can you provide a solution for this?
   Jos Chrispijn

More information about the freebsd-ports mailing list