Port devel/gdb broken on 11-CURRENT amd64.

Mark R V Murray markm at FreeBSD.org
Mon Mar 24 07:53:46 UTC 2014

/bin/sh ./libtool --tag=CC   --mode=compile cc -DHAVE_CONFIG_H -I. -I. -I. -I./../include  -DHAVE_all_vecs  -DBINDIR='"/usr/local/bin"' -I/usr/local/include -W -Wall -Wstrict-prototypes -Wmissing-prototypes -Wshadow -Werror -O2 -pipe  -DRL_NO_COMPAT -fno-strict-aliasing -std=gnu89 -MT coff-x86_64.lo -MD -MP -MF .deps/coff-x86_64.Tpo -c -o coff-x86_64.lo coff-x86_64.c
libtool: compile:  cc -DHAVE_CONFIG_H -I. -I. -I. -I./../include -DHAVE_all_vecs -DBINDIR=\"/usr/local/bin\" -I/usr/local/include -W -Wall -Wstrict-prototypes -Wmissing-prototypes -Wshadow -Werror -O2 -pipe -DRL_NO_COMPAT -fno-strict-aliasing -std=gnu89 -MT coff-x86_64.lo -MD -MP -MF .deps/coff-x86_64.Tpo -c coff-x86_64.c -o coff-x86_64.o
elf64-aarch64.c:3221:1: error: unused function 'decode_branch_ofs_26' [-Werror,-Wunused-function]
decode_branch_ofs_26 (uint32_t insn)
elf64-aarch64.c:3228:1: error: unused function 'decode_cond_branch_ofs_19' [-Werror,-Wunused-function]
decode_cond_branch_ofs_19 (uint32_t insn)
elf64-aarch64.c:3235:1: error: unused function 'decode_ld_lit_ofs_19' [-Werror,-Wunused-function]
decode_ld_lit_ofs_19 (uint32_t insn)
elf64-aarch64.c:3242:1: error: unused function 'decode_tst_branch_ofs_14' [-Werror,-Wunused-function]
decode_tst_branch_ofs_14 (uint32_t insn)
elf64-aarch64.c:3249:1: error: unused function 'decode_movw_imm' [-Werror,-Wunused-function]
decode_movw_imm (uint32_t insn)
elf64-aarch64.c:3256:1: error: unused function 'decode_adr_imm' [-Werror,-Wunused-function]
decode_adr_imm (uint32_t insn)
elf64-aarch64.c:3263:1: error: unused function 'decode_add_imm' [-Werror,-Wunused-function]
decode_add_imm (uint32_t insn)
7 errors generated.
mv -f .deps/pei-i386.Tpo .deps/pei-i386.Plo
/bin/sh ./libtool --tag=CC   --mode=compile cc -DHAVE_CONFIG_H -I. -I. -I. -I./../include  -DHAVE_all_vecs  -DBINDIR='"/usr/local/bin"' -I/usr/local/include -W -Wall -Wstrict-prototypes -Wmissing-prototypes -Wshadow -Werror -O2 -pipe  -DRL_NO_COMPAT -fno-strict-aliasing -std=gnu89 -MT coff64-rs6000.lo -MD -MP -MF .deps/coff64-rs6000.Tpo -c -o coff64-rs6000.lo coff64-rs6000.c
gmake[5]: *** [elf64-aarch64.lo] Error 1
gmake[5]: *** Waiting for unfinished jobs....
libtool: compile:  cc -DHAVE_CONFIG_H -I. -I. -I. -I./../include -DHAVE_all_vecs -DBINDIR=\"/usr/local/bin\" -I/usr/local/include -W -Wall -Wstrict-prototypes -Wmissing-prototypes -Wshadow -Werror -O2 -pipe -DRL_NO_COMPAT -fno-strict-aliasing -std=gnu89 -MT coff64-rs6000.lo -MD -MP -MF .deps/coff64-rs6000.Tpo -c coff64-rs6000.c -o coff64-rs6000.o
mv -f .deps/pei-x86_64.Tpo .deps/pei-x86_64.Plo
mv -f .deps/coff-alpha.Tpo .deps/coff-alpha.Plo
mv -f .deps/coff-x86_64.Tpo .deps/coff-x86_64.Plo
mv -f .deps/coff64-rs6000.Tpo .deps/coff64-rs6000.Plo
mv -f .deps/aout64.Tpo .deps/aout64.Plo
mv -f .deps/elf.Tpo .deps/elf.Plo
mv -f .deps/elflink.Tpo .deps/elflink.Plo
gmake[5]: Leaving directory `/usr/ports/devel/gdb/work/gdb-7.6.2/bfd'
gmake[4]: *** [all-recursive] Error 1
gmake[4]: Leaving directory `/usr/ports/devel/gdb/work/gdb-7.6.2/bfd'
gmake[3]: *** [all] Error 2
gmake[3]: Leaving directory `/usr/ports/devel/gdb/work/gdb-7.6.2/bfd'
gmake[2]: *** [all-bfd] Error 2
gmake[2]: Leaving directory `/usr/ports/devel/gdb/work/gdb-7.6.2'
gmake[1]: *** [all] Error 2
gmake[1]: Leaving directory `/usr/ports/devel/gdb/work/gdb-7.6.2'
===> Compilation failed unexpectedly.
Try to set MAKE_JOBS_UNSAFE=yes and rebuild before reporting the failure to
the maintainer.
*** Error code 1

make: stopped in /usr/ports/devel/gdb

Mark R V Murray

-------------- next part --------------
A non-text attachment was scrubbed...
Name: signature.asc
Type: application/pgp-signature
Size: 353 bytes
Desc: Message signed with OpenPGP using GPGMail
URL: <http://lists.freebsd.org/pipermail/freebsd-ports/attachments/20140324/a5f53490/attachment-0001.sig>

More information about the freebsd-ports mailing list