nautilus build failure

Carmel carmel_ny at
Thu Jan 26 19:55:55 UTC 2012

FreeBSD-8.2 amd64

I am unable to build nautilus. The build ends with this error message:

grep: /usr/local/lib/ No such file or directory
sed: /usr/local/lib/ No such file or directory
gnome-libtool: link: `/usr/local/lib/' is not a valid libtool archive
gmake[2]: *** [] Error 1
gmake[2]: Leaving directory `/usr/ports/x11-fm/nautilus/work/nautilus-'
gmake[1]: *** [all-recursive] Error 1
gmake[1]: Leaving directory `/usr/ports/x11-fm/nautilus/work/nautilus-'
gmake: *** [all] Error 2
*** Error code 1
Stop in /usr/ports/x11-fm/nautilus.

The entire build log is located at:

carmel_ny at

More information about the freebsd-ports mailing list