openjdk build failure

Per olof Ljungmark peo at
Fri May 13 06:16:32 UTC 2011

Recent sources

8.2-STABLE FreeBSD 8.2-STABLE #0: Wed May 11 20:28:31 CEST 2011

doing make in /usr/ports/java/openjdk7:


    [javac] Compiling 67 source files to
method does not override or implement a method from a supertype
    [javac]             @Override
    [javac]             ^
    [javac] 1 error

/usr/ports/java/openjdk7/work/openjdk/langtools/make/build.xml:413: The
following error occurred while executing this line:
Compile failed; see the compiler error output for details.

Total time: 4 seconds
gmake[2]: *** [build] Error 1
gmake[2]: Leaving directory
gmake[1]: *** [langtools-build] Error 2
gmake[1]: Leaving directory `/usr/ports/java/openjdk7/work/openjdk'
gmake: *** [build_product_image] Error 2
*** Error code 1

More information about the freebsd-ports mailing list