KDE 3.2 build problem... spinlock?

Jaye Mathisen mrcpu at internetcds.com
Fri Feb 6 11:02:44 PST 2004

No idea what's going on.  I was getting this same error building KDE 3.1.4, but
held off on the report until after 3.2 was imported...

../dcop/dcopidl/dcopidl ./ksycoca.h > ksycoca.kidl || ( rm -f ksycoca.kidl ; false )
Fatal error 'Spinlock called when not threaded.' at line 83 in file /usr/src/lib/libpthread/thread/thr_spinlock.c (errno = 0)
Abort trap (core dumped)
gmake[3]: *** [ksycoca.kidl] Error 1
gmake[3]: Leaving directory `/usr/ports/x11/kdelibs3/work/kdelibs-3.2.0/kdecore'
gmake[2]: *** [all-recursive] Error 1
gmake[2]: Leaving directory `/usr/ports/x11/kdelibs3/work/kdelibs-3.2.0/kdecore'
gmake[1]: *** [all-recursive] Error 1
gmake[1]: Leaving directory `/usr/ports/x11/kdelibs3/work/kdelibs-3.2.0'

More information about the freebsd-ports mailing list