Errors installing DC

Wee Tiong Ang ang_wee_tiong at
Sun Oct 5 15:36:43 PDT 2003


Got the following error which I have no idea whatsoever:

===>  Building for opendchub-0.7.4
gmake  all-recursive
gmake[1]: Entering directory `/usr/ports/net/opendchub/work/opendchub-0.7.4'
Making all in src
gmake[2]: Entering directory 
`/usr/ports/net/opendchub/work/opendchub-0.7.4/src'cc  -O -pipe   -o 
opendchub  commands.o fileio.o main.o network.o perl_utils.o utils.o 
xs_functions.o -Wl,-R/usr/lib -Wl,-E -lperl -lm  
-L/usr/libdata/perl/5.00503/mach/CORE -lperl -lm -lc -lcrypt -lperl -lm
perl_utils.o: In function `sub_to_script':
perl_utils.o(.text+0xc77): undefined reference to `call_pv'
gmake[2]: *** [opendchub] Error 1
gmake[2]: Leaving directory 
gmake[1]: *** [all-recursive] Error 1
gmake[1]: Leaving directory `/usr/ports/net/opendchub/work/opendchub-0.7.4'
gmake: *** [all-recursive-am] Error 2
*** Error code 2

Please advise...

Wee Tiong

Download games, logos, wallpapers and lots more at MSN Mobile!

More information about the freebsd-ports mailing list