[package - head-i386-default][lang/pypy3-devel] Failed for pypy3-2.4.0 in build
pkg-fallout at FreeBSD.org
pkg-fallout at FreeBSD.org
Thu May 12 18:56:24 UTC 2016
You are receiving this mail as a port that you maintain
is failing to build on the FreeBSD package build server.
Please investigate the failure and submit a PR to fix
build.
Maintainer: dbn at FreeBSD.org
Last committer: swills at FreeBSD.org
Ident: $FreeBSD: head/lang/pypy3-devel/Makefile 413746 2016-04-21 16:43:14Z swills $
Log URL: http://beefy3.nyi.freebsd.org/data/head-i386-default/p415043_s299496/logs/pypy3-2.4.0.log
Build URL: http://beefy3.nyi.freebsd.org/build.html?mastername=head-i386-default&build=p415043_s299496
Log:
====>> Building lang/pypy3-devel
build started at Thu May 12 18:55:55 UTC 2016
port directory: /usr/ports/lang/pypy3-devel
building for: FreeBSD head-i386-default-job-03 11.0-CURRENT FreeBSD 11.0-CURRENT r299496 i386
maintained by: dbn at FreeBSD.org
Makefile ident: $FreeBSD: head/lang/pypy3-devel/Makefile 413746 2016-04-21 16:43:14Z swills $
Poudriere version: 3.1.12
Host OSVERSION: 1100106
Jail OSVERSION: 1100107
!!! Jail is newer than host. (Jail: 1100107, Host: 1100106) !!!
!!! This is not supported. !!!
!!! Host kernel must be same or newer than jail. !!!
!!! Expect build failures. !!!
---Begin Environment---
SHELL=/bin/csh
UNAME_p=i386
UNAME_m=i386
UNAME_v=FreeBSD 11.0-CURRENT r299496
UNAME_r=11.0-CURRENT
BLOCKSIZE=K
MAIL=/var/mail/root
STATUS=1
OPSYS=FreeBSD
ARCH=i386
LINUX_OSRELEASE=2.6.32
SAVED_TERM=
MASTERMNT=/usr/local/poudriere/data/.m/head-i386-default/ref
UID=0
PATH=/sbin:/bin:/usr/sbin:/usr/bin:/usr/local/sbin:/usr/local/bin:/root/bin
_JAVA_VERSION_LIST_REGEXP=1.6\|1.7\|1.8\|1.6+\|1.7+\|1.8+
POUDRIERE_BUILD_TYPE=bulk
PKGNAME=pypy3-2.4.0
OSREL=11.0
_OSRELEASE=11.0-CURRENT
PYTHONBASE=/usr/local
OLDPWD=/
_SMP_CPUS=24
PWD=/usr/local/poudriere/data/.m/head-i386-default/ref/.p/pool
MASTERNAME=head-i386-default
SCRIPTPREFIX=/usr/local/share/poudriere
_JAVA_VENDOR_LIST_REGEXP=openjdk\|oracle\|sun
USER=root
HOME=/root
POUDRIERE_VERSION=3.1.12
SCRIPTPATH=/usr/local/share/poudriere/bulk.sh
CONFIGURE_MAX_CMD_LEN=262144
LIBEXECPREFIX=/usr/local/libexec/poudriere
LOCALBASE=/usr/local
PACKAGE_BUILDING=yes
_JAVA_OS_LIST_REGEXP=native\|linux
OSVERSION=1100107
---End Environment---
---Begin OPTIONS List---
===> The following configuration options are available for pypy3-2.4.0:
====> Options available for the group PYINST
SANDBOX=off: Translate a sandboxed pypy
===> Use 'make config' to modify these settings
---End OPTIONS List---
--CONFIGURE_ARGS--
--End CONFIGURE_ARGS--
--CONFIGURE_ENV--
PYTHON="/usr/local/bin/python2.7" XDG_DATA_HOME=/wrkdirs/usr/ports/lang/pypy3-devel/work XDG_CONFIG_HOME=/wrkdirs/usr/ports/lang/pypy3-devel/work HOME=/wrkdirs/usr/ports/lang/pypy3-devel/work TMPDIR="/tmp" SHELL=/bin/sh CONFIG_SHELL=/bin/sh
--End CONFIGURE_ENV--
--MAKE_ENV--
DISTVERSION=2.4.0 PYTHON_CMD=/usr/local/bin/python2.7 WRKSRC=/wrkdirs/usr/ports/lang/pypy3-devel/work/pypy3-2.4.0-src PYPY_LOCALBASE=/usr/local PYPY_INST="DEFAULT" PYPY_DEFAULT_NAME="pypy" PYPY_DEFAULT_OBJSPACE_ARGS="" PYPY_DEFAULT_OPT="jit" PYPY_DEFAULT_TRANSLATE_ARGS="" XDG_DATA_HOME=/wrkdirs/usr/ports/lang/pypy3-devel/work XDG_CONFIG_HOME=/wrkdirs/usr/ports/lang/pypy3-devel/work HOME=/wrkdirs/usr/ports/lang/pypy3-devel/work TMPDIR="/tmp" NO_PIE=yes WITHOUT_DEBUG_FILES=yes WITHOUT_KERNEL_SYMBOLS=yes SHELL=/bin/sh NO_LINT=YES PREFIX=/usr/local LOCALBASE=/usr/local LIBDIR="/usr/lib" CC="cc" CFLAGS="-O2 -pipe -fstack-protector -fno-strict-aliasing" CPP="cpp" CPPFLAGS="" LDFLAGS=" -fstack-protector" LIBS="" CXX="c++" CXXFLAGS="-O2 -pipe -fstack-protector -fno-strict-aliasing " MANPREFIX="/usr/local" BSD_INSTALL_PROGRAM="install -s -m 555" BSD_INSTALL_LIB="install -s -m 444" BSD_INSTALL_SCRIPT="install -m 555" BSD_INSTALL_DATA="install -m 0644" BSD_INSTALL_MAN="ins
tall -m 444"
--End MAKE_ENV--
--PLIST_SUB--
PYPY_LIBDIR=lib/pypy3-2.4
PYPY_INCLUDEDIR=include/pypy3-2.4
PYPY_ARCH="x86_32"
PYPY_BITS="32"
PYPY_VER="24"
PYTHON_INCLUDEDIR=include/python2.7
PYTHON_LIBDIR=lib/python2.7
PYTHON_PLATFORM=freebsd11
PYTHON_SITELIBDIR=lib/python2.7/site-packages
PYTHON_VER=2.7
PYTHON_VERSION=python2.7
OSREL=11.0
PREFIX=%D
LOCALBASE=/usr/local
RESETPREFIX=/usr/local
PORTDOCS=""
PORTEXAMPLES=""
LIB32DIR=lib
DOCSDIR="share/doc/pypy3"
EXAMPLESDIR="share/examples/pypy3"
DATADIR="share/pypy3"
WWWDIR="www/pypy3"
ETCDIR="etc/pypy3"
--End PLIST_SUB--
--SUB_LIST--
PREFIX=/usr/local
LOCALBASE=/usr/local
DATADIR=/usr/local/share/pypy3
DOCSDIR=/usr/local/share/doc/pypy3
EXAMPLESDIR=/usr/local/share/examples/pypy3
WWWDIR=/usr/local/www/pypy3
ETCDIR=/usr/local/etc/pypy3
--End SUB_LIST--
---Begin make.conf---
MACHINE=i386
MACHINE_ARCH=i386
ARCH=${MACHINE_ARCH}
USE_PACKAGE_DEPENDS=yes
BATCH=yes
WRKDIRPREFIX=/wrkdirs
PORTSDIR=/usr/ports
PACKAGES=/packages
DISTDIR=/distfiles
#### /usr/local/etc/poudriere.d/make.conf ####
DISABLE_MAKE_JOBS=poudriere
---End make.conf---
=======================<phase: check-sanity >============================
===> License MIT PSFL accepted by the user
===========================================================================
=======================<phase: pkg-depends >============================
===> pypy3-2.4.0 depends on file: /usr/local/sbin/pkg - not found
===> Installing existing package /packages/All/pkg-1.7.2.txz
[head-i386-default-job-03] Installing pkg-1.7.2...
[head-i386-default-job-03] Extracting pkg-1.7.2: .......... done
===> pypy3-2.4.0 depends on file: /usr/local/sbin/pkg - found
===> Returning to build of pypy3-2.4.0
===========================================================================
=======================<phase: fetch-depends >============================
===========================================================================
=======================<phase: fetch >============================
===> License MIT PSFL accepted by the user
Please see http://wiki.FreeBSD.org/PyPy for more details on the port or make usage for a summary
===> Fetching all distfiles required by pypy3-2.4.0 for building
===========================================================================
=======================<phase: checksum >============================
===> License MIT PSFL accepted by the user
Please see http://wiki.FreeBSD.org/PyPy for more details on the port or make usage for a summary
===> Fetching all distfiles required by pypy3-2.4.0 for building
=> SHA256 Checksum OK for pypy3-2.4.0-src.tar.bz2.
===========================================================================
=======================<phase: extract-depends>============================
===========================================================================
=======================<phase: extract >============================
===> License MIT PSFL accepted by the user
Please see http://wiki.FreeBSD.org/PyPy for more details on the port or make usage for a summary
===> Fetching all distfiles required by pypy3-2.4.0 for building
===> Extracting for pypy3-2.4.0
=> SHA256 Checksum OK for pypy3-2.4.0-src.tar.bz2.
/bin/mkdir -p /wrkdirs/usr/ports/lang/pypy3-devel/work/`/usr/bin/dirname lib/pypy3-2.4`
/bin/ln -s /wrkdirs/usr/ports/lang/pypy3-devel/work/pypy3-2.4.0-src/lib-python/3 /wrkdirs/usr/ports/lang/pypy3-devel/work/lib/pypy3-2.4
/bin/mkdir -p /wrkdirs/usr/ports/lang/pypy3-devel/work/`/usr/bin/dirname lib/pypy3-2.4/lib_pypy`
/bin/ln -s /wrkdirs/usr/ports/lang/pypy3-devel/work/pypy3-2.4.0-src/lib_pypy /wrkdirs/usr/ports/lang/pypy3-devel/work/lib/pypy3-2.4/lib_pypy
/bin/mkdir -p /wrkdirs/usr/ports/lang/pypy3-devel/work/`/usr/bin/dirname include/pypy3-2.4`
/bin/ln -s /wrkdirs/usr/ports/lang/pypy3-devel/work/pypy3-2.4.0-src/include /wrkdirs/usr/ports/lang/pypy3-devel/work/include/pypy3-2.4
/bin/ln -s /wrkdirs/usr/ports/lang/pypy3-devel/work/lib /wrkdirs/usr/ports/lang/pypy3-devel/work/pypy3-2.4.0-src/lib
===========================================================================
=======================<phase: patch-depends >============================
===========================================================================
=======================<phase: patch >============================
===> Patching for pypy3-2.4.0
===> Applying FreeBSD patches for pypy3-2.4.0
===========================================================================
=======================<phase: build-depends >============================
===> pypy3-2.4.0 depends on executable: msgfmt - not found
===> Installing existing package /packages/All/gettext-tools-0.19.7.txz
[head-i386-default-job-03] Installing gettext-tools-0.19.7...
[head-i386-default-job-03] `-- Installing indexinfo-0.2.4...
[head-i386-default-job-03] `-- Extracting indexinfo-0.2.4: .... done
[head-i386-default-job-03] `-- Installing gettext-runtime-0.19.7...
[head-i386-default-job-03] `-- Extracting gettext-runtime-0.19.7: .......... done
[head-i386-default-job-03] Extracting gettext-tools-0.19.7: .......... done
===> pypy3-2.4.0 depends on executable: msgfmt - found
===> Returning to build of pypy3-2.4.0
===> pypy3-2.4.0 depends on file: /usr/local/bin/python2.7 - not found
===> Installing existing package /packages/All/python27-2.7.11_2.txz
[head-i386-default-job-03] Installing python27-2.7.11_2...
[head-i386-default-job-03] `-- Installing libffi-3.2.1...
[head-i386-default-job-03] `-- Extracting libffi-3.2.1: .......... done
[head-i386-default-job-03] `-- Installing readline-6.3.8...
[head-i386-default-job-03] `-- Extracting readline-6.3.8: .......... done
[head-i386-default-job-03] Extracting python27-2.7.11_2: .......... done
Message from python27-2.7.11_2:
===========================================================================
Note that some standard Python modules are provided as separate ports
as they require additional dependencies. They are available as:
bsddb databases/py-bsddb
gdbm databases/py-gdbm
sqlite3 databases/py-sqlite3
tkinter x11-toolkits/py-tkinter
===========================================================================
===> pypy3-2.4.0 depends on file: /usr/local/bin/python2.7 - found
===> Returning to build of pypy3-2.4.0
===> pypy3-2.4.0 depends on executable: python2 - not found
===> Installing existing package /packages/All/python2-2_3.txz
[head-i386-default-job-03] Installing python2-2_3...
[head-i386-default-job-03] Extracting python2-2_3: ...... done
===> pypy3-2.4.0 depends on executable: python2 - found
===> Returning to build of pypy3-2.4.0
===========================================================================
=======================<phase: lib-depends >============================
===> pypy3-2.4.0 depends on shared library: libexpat.so - not found
===> Installing existing package /packages/All/expat-2.1.0_3.txz
[head-i386-default-job-03] Installing expat-2.1.0_3...
[head-i386-default-job-03] Extracting expat-2.1.0_3: .......... done
===> pypy3-2.4.0 depends on shared library: libexpat.so - found (/usr/local/lib/libexpat.so)
===> Returning to build of pypy3-2.4.0
===> pypy3-2.4.0 depends on shared library: libffi.so - found (/usr/local/lib/libffi.so)
===> pypy3-2.4.0 depends on shared library: libsqlite3.so - not found
===> Installing existing package /packages/All/sqlite3-3.12.2.txz
[head-i386-default-job-03] Installing sqlite3-3.12.2...
[head-i386-default-job-03] Extracting sqlite3-3.12.2: .......... done
===> pypy3-2.4.0 depends on shared library: libsqlite3.so - found (/usr/local/lib/libsqlite3.so)
===> Returning to build of pypy3-2.4.0
===> pypy3-2.4.0 depends on shared library: libintl.so - found (/usr/local/lib/libintl.so)
===========================================================================
=======================<phase: configure >============================
===> Configuring for pypy3-2.4.0
/usr/bin/sed -e 's|%%PREFIX%%|/usr/local|g' -e 's|%%PYPY_NAMES%%|pypy|g' -e 's|%%PYPY_VER%%|2.4|g' /usr/ports/lang/pypy3-devel/files/use.pypy > /wrkdirs/usr/ports/lang/pypy3-devel/work/use.pypy
cp -f /wrkdirs/usr/ports/lang/pypy3-devel/work/use.pypy /wrkdirs/usr/ports/lang/pypy3-devel/work/pkg-install
cp -f /wrkdirs/usr/ports/lang/pypy3-devel/work/use.pypy /wrkdirs/usr/ports/lang/pypy3-devel/work/pkg-deinstall
===========================================================================
=======================<phase: build >============================
===> Building for pypy3-2.4.0
rm -rf build_pypy
mkdir build_pypy
(cd /wrkdirs/usr/ports/lang/pypy3-devel/work/pypy3-2.4.0-src/pypy/goal; /usr/bin/time -l env TMPDIR=/wrkdirs/usr/ports/lang/pypy3-devel/work/build_pypy /usr/local/bin/python2.7 ../../rpython/bin/rpython --source -Ojit targetpypystandalone.py )
[translation:info] 2.7.11 (default, May 12 2016, 18:53:23)
[translation:info] [GCC 4.2.1 Compatible FreeBSD Clang 3.8.0 (tags/RELEASE_380/final 262564)]
[platform:msg] Set platform with 'host' cc=None, using cc='cc'
[translation:info] Translating target as defined by targetpypystandalone
[platform:execute] cc -c -O3 -pthread -fomit-frame-pointer -O2 -pipe -fstack-protector -fno-strict-aliasing -I/usr/local/include -I/usr/local/include /wrkdirs/usr/ports/lang/pypy3-devel/work/build_pypy/usession-pypy3-release-2.4.x-0/gcctest.c -o /wrkdirs/usr/ports/lang/pypy3-devel/work/build_pypy/usession-pypy3-release-2.4.x-0/gcctest.o
[platform:execute] cc -c -O3 -pthread -fomit-frame-pointer -O2 -pipe -fstack-protector -fno-strict-aliasing -I/usr/local/include -I/usr/local/include /wrkdirs/usr/ports/lang/pypy3-devel/work/build_pypy/usession-pypy3-release-2.4.x-0/gcctest.c -o /wrkdirs/usr/ports/lang/pypy3-devel/work/build_pypy/usession-pypy3-release-2.4.x-0/gcctest.o
[platform:execute] cc /wrkdirs/usr/ports/lang/pypy3-devel/work/build_pypy/usession-pypy3-release-2.4.x-0/gcctest.o -L/usr/local/lib -L/usr/local/lib -pthread -fstack-protector -o /wrkdirs/usr/ports/lang/pypy3-devel/work/build_pypy/usession-pypy3-release-2.4.x-0/gcctest
[platform:execute] cc -c -O3 -pthread -fomit-frame-pointer -O2 -pipe -fstack-protector -fno-strict-aliasing -I/usr/local/include -I/usr/local/include /wrkdirs/usr/ports/lang/pypy3-devel/work/build_pypy/usession-pypy3-release-2.4.x-0/platcheck_0.c -o /wrkdirs/usr/ports/lang/pypy3-devel/work/build_pypy/usession-pypy3-release-2.4.x-0/platcheck_0.o
[platform:execute] cc -c -O3 -pthread -fomit-frame-pointer -O2 -pipe -fstack-protector -fno-strict-aliasing -I/usr/local/include -I/usr/local/include /wrkdirs/usr/ports/lang/pypy3-devel/work/build_pypy/usession-pypy3-release-2.4.x-0/platcheck_1.c -o /wrkdirs/usr/ports/lang/pypy3-devel/work/build_pypy/usession-pypy3-release-2.4.x-0/platcheck_1.o
[platform:execute] cc -c -O3 -pthread -fomit-frame-pointer -O2 -pipe -fstack-protector -fno-strict-aliasing -I/usr/local/include -I/usr/local/include /wrkdirs/usr/ports/lang/pypy3-devel/work/build_pypy/usession-pypy3-release-2.4.x-0/platcheck_2.c -o /wrkdirs/usr/ports/lang/pypy3-devel/work/build_pypy/usession-pypy3-release-2.4.x-0/platcheck_2.o
[platform:Error] In file included from /wrkdirs/usr/ports/lang/pypy3-devel/work/build_pypy/usession-pypy3-release-2.4.x-0/platcheck_2.c:41:
[platform:Error] /usr/include/stdio.h:435:17: error: function cannot return function type 'int (void *, char *, size_t)' (aka 'int (void *, char *, unsigned int)')
[platform:Error] typedef ssize_t (cookie_read_function_t)(void *, char *, size_t);
[platform:Error] ^
[platform:Error] /usr/include/stdio.h:435:18: error: a parameter list without types is only allowed in a function definition
[platform:Error] typedef ssize_t (cookie_read_function_t)(void *, char *, size_t);
[platform:Error] ^
[platform:Error] /usr/include/stdio.h:436:42: error: function cannot return function type 'ssize_t' (aka 'int ()')
[platform:Error] typedef ssize_t (cookie_write_function_t)(void *, const char *, size_t);
[platform:Error] ^
[platform:Error] /usr/include/stdio.h:440:2: error: unknown type name 'cookie_read_function_t'; did you mean 'cookie_seek_function_t'?
[platform:Error] cookie_read_function_t *read;
[platform:Error] ^
[platform:Error] /usr/include/stdio.h:437:14: note: 'cookie_seek_function_t' declared here
[platform:Error] typedef int (cookie_seek_function_t)(void *, off64_t *, int);
[platform:Error] ^
[platform:Error] 4 errors generated.
Traceback (most recent call last):
File "../../rpython/bin/rpython", line 20, in <module>
main()
File "/wrkdirs/usr/ports/lang/pypy3-devel/work/pypy3-2.4.0-src/rpython/translator/goal/translate.py", line 217, in main
targetspec_dic, translateconfig, config, args = parse_options_and_load_target()
File "/wrkdirs/usr/ports/lang/pypy3-devel/work/pypy3-2.4.0-src/rpython/translator/goal/translate.py", line 156, in parse_options_and_load_target
targetspec_dic = load_target(targetspec)
File "/wrkdirs/usr/ports/lang/pypy3-devel/work/pypy3-2.4.0-src/rpython/translator/goal/translate.py", line 98, in load_target
mod = __import__(specname)
File "targetpypystandalone.py", line 11, in <module>
from rpython.rlib import rlocale
File "/wrkdirs/usr/ports/lang/pypy3-devel/work/pypy3-2.4.0-src/rpython/rlib/rlocale.py", line 142, in <module>
for k, v in platform.configure(CConfig).items():
File "/wrkdirs/usr/ports/lang/pypy3-devel/work/pypy3-2.4.0-src/rpython/rtyper/tool/rffi_platform.py", line 224, in configure
ignore_errors=ignore_errors))
File "/wrkdirs/usr/ports/lang/pypy3-devel/work/pypy3-2.4.0-src/rpython/rtyper/tool/rffi_platform.py", line 731, in run_example_code
output = build_executable_cache(files, eci, ignore_errors=ignore_errors)
File "/wrkdirs/usr/ports/lang/pypy3-devel/work/pypy3-2.4.0-src/rpython/tool/gcc_cache.py", line 28, in build_executable_cache
result = platform.execute(platform.compile(c_files, eci))
File "/wrkdirs/usr/ports/lang/pypy3-devel/work/pypy3-2.4.0-src/rpython/translator/platform/__init__.py", line 53, in compile
ofiles = self._compile_o_files(cfiles, eci, standalone)
File "/wrkdirs/usr/ports/lang/pypy3-devel/work/pypy3-2.4.0-src/rpython/translator/platform/__init__.py", line 75, in _compile_o_files
ofiles.append(self._compile_c_file(self.cc, cfile, compile_args))
File "/wrkdirs/usr/ports/lang/pypy3-devel/work/pypy3-2.4.0-src/rpython/translator/platform/posix.py", line 39, in _compile_c_file
cwd=str(cfile.dirpath()))
File "/wrkdirs/usr/ports/lang/pypy3-devel/work/pypy3-2.4.0-src/rpython/translator/platform/__init__.py", line 139, in _execute_c_compiler
self._handle_error(returncode, stdout, stderr, outname)
File "/wrkdirs/usr/ports/lang/pypy3-devel/work/pypy3-2.4.0-src/rpython/translator/platform/__init__.py", line 151, in _handle_error
raise CompilationError(stdout, stderr)
rpython.translator.platform.CompilationError: CompilationError(err="""
In file included from /wrkdirs/usr/ports/lang/pypy3-devel/work/build_pypy/usession-pypy3-release-2.4.x-0/platcheck_2.c:41:
/usr/include/stdio.h:435:17: error: function cannot return function type 'int (void *, char *, size_t)' (aka 'int (void *, char *, unsigned int)')
typedef ssize_t (cookie_read_function_t)(void *, char *, size_t);
^
/usr/include/stdio.h:435:18: error: a parameter list without types is only allowed in a function definition
typedef ssize_t (cookie_read_function_t)(void *, char *, size_t);
^
/usr/include/stdio.h:436:42: error: function cannot return function type 'ssize_t' (aka 'int ()')
typedef ssize_t (cookie_write_function_t)(void *, const char *, size_t);
^
/usr/include/stdio.h:440:2: error: unknown type name 'cookie_read_function_t'; did you mean 'cookie_seek_function_t'?
cookie_read_function_t *read;
^
/usr/include/stdio.h:437:14: note: 'cookie_seek_function_t' declared here
typedef int (cookie_seek_function_t)(void *, off64_t *, int);
^
4 errors generated.
""")
2.36 real 1.76 user 0.22 sys
119124 maximum resident set size
4 average shared memory size
4 average unshared data size
128 average unshared stack size
42039 page reclaims
0 page faults
0 swaps
0 block input operations
77 block output operations
0 messages sent
0 messages received
0 signals received
69 voluntary context switches
566 involuntary context switches
*** Error code 1
Stop.
make[1]: stopped in /wrkdirs/usr/ports/lang/pypy3-devel/work
*** Error code 1
Stop.
make: stopped in /usr/ports/lang/pypy3-devel
More information about the freebsd-pkg-fallout
mailing list