[package - main-arm64-default][java/openjdk12] Failed for openjdk12-12.0.2+10.4_1 in build

pkg-fallout at FreeBSD.org pkg-fallout at FreeBSD.org
Fri Feb 5 18:14:57 UTC 2021


You are receiving this mail as a port that you maintain
is failing to build on the FreeBSD package build server.
Please investigate the failure and submit a PR to fix
build.

Maintainer:     java at FreeBSD.org
Last committer: glewis at FreeBSD.org
Ident:          $FreeBSD: head/java/openjdk12/Makefile 542063 2020-07-12 02:13:27Z glewis $
Log URL:        http://ampere2.nyi.freebsd.org/data/main-arm64-default/p563982_scb7cc72c54/logs/openjdk12-12.0.2+10.4_1.log
Build URL:      http://ampere2.nyi.freebsd.org/build.html?mastername=main-arm64-default&build=p563982_scb7cc72c54
Log:

=>> Building java/openjdk12
build started at Fri Feb  5 18:10:02 UTC 2021
port directory: /usr/ports/java/openjdk12
package name: openjdk12-12.0.2+10.4_1
building for: FreeBSD main-arm64-default-job-05 14.0-CURRENT FreeBSD 14.0-CURRENT 1400003 arm64
maintained by: java at FreeBSD.org
Makefile ident:      $FreeBSD: head/java/openjdk12/Makefile 542063 2020-07-12 02:13:27Z glewis $
Poudriere version: 3.2.8-8-gaf08dbda
Host OSVERSION: 1300134
Jail OSVERSION: 1400003
Job Id: 05




!!! Jail is newer than host. (Jail: 1400003, Host: 1300134) !!!
!!! This is not supported. !!!
!!! Host kernel must be same or newer than jail. !!!
!!! Expect build failures. !!!



---Begin Environment---
SHELL=/bin/csh
OSVERSION=1400003
UNAME_v=FreeBSD 14.0-CURRENT 1400003
UNAME_r=14.0-CURRENT
BLOCKSIZE=K
MAIL=/var/mail/root
MM_CHARSET=UTF-8
LANG=C.UTF-8
STATUS=1
HOME=/root
PATH=/sbin:/bin:/usr/sbin:/usr/bin:/usr/local/sbin:/usr/local/bin:/root/bin
LOCALBASE=/usr/local
USER=root
LIBEXECPREFIX=/usr/local/libexec/poudriere
POUDRIERE_VERSION=3.2.8-8-gaf08dbda
MASTERMNT=/usr/local/poudriere/data/.m/main-arm64-default/ref
POUDRIERE_BUILD_TYPE=bulk
PACKAGE_BUILDING=yes
SAVED_TERM=
PWD=/usr/local/poudriere/data/.m/main-arm64-default/ref/.p/pool
P_PORTS_FEATURES=FLAVORS SELECTED_OPTIONS
MASTERNAME=main-arm64-default
SCRIPTPREFIX=/usr/local/share/poudriere
OLDPWD=/usr/local/poudriere/data/.m/main-arm64-default/ref/.p
SCRIPTPATH=/usr/local/share/poudriere/bulk.sh
POUDRIEREPATH=/usr/local/bin/poudriere
---End Environment---

---Begin Poudriere Port Flags/Env---
PORT_FLAGS=
PKGENV=
FLAVOR=
DEPENDS_ARGS=
MAKE_ARGS=
---End Poudriere Port Flags/Env---

---Begin OPTIONS List---
---End OPTIONS List---

--MAINTAINER--
java at FreeBSD.org
--End MAINTAINER--

--CONFIGURE_ARGS--
--with-boot-jdk=/usr/local/bootstrap-openjdk11  --disable-ccache  --disable-javac-server  --disable-hotspot-gtest  --with-alsa=/usr/local  --with-cups=/usr/local  --with-fontconfig=/usr/local  --with-freetype=system  --with-freetype-include=/usr/local/include/freetype2  --with-freetype-lib=/usr/local/lib  --with-libjpeg=system  --with-giflib=system  --with-giflib-include=/usr/local/include  --with-giflib-lib=/usr/local/lib  --with-libpng=system  --with-zlib=system  --with-lcms=system  --x-includes=/usr/local/include  --x-libraries=/usr/local/lib  --with-cacerts-file=/usr/ports/java/openjdk12/files/cacerts  --with-version-string=12.0.2+10-4  --with-native-debug-symbols=none  --with-debug-level=release  --with-vendor-name="OpenJDK BSD Porting Team"  --with-vendor-url="https://github.com/battleblow/openjdk-jdk12u/"  --with-vendor-bug-url="https://bugs.freebsd.org/bugzilla/enter_bug.cgi?product=Ports%20%26%20Packages&component=Individual%20Port(s)&short_desc=java/openjdk12%3A%20"  --with
 -vendor-vm-bug-url="https://bugs.freebsd.org/bugzilla/enter_bug.cgi?product=Ports%20%26%20Packages&component=Individual%20Port(s)&short_desc=java/openjdk12%3A%20" --with-toolchain-type=clang --disable-warnings-as-errors  --disable-dtrace --enable-aot=no --x-libraries=/usr/local/lib --x-includes=/usr/local/include --prefix=/usr/local ${_LATE_CONFIGURE_ARGS}
--End CONFIGURE_ARGS--

--CONFIGURE_ENV--
CC=cc  CXX=c++  CPP=cpp  ac_cv_path_SED=/usr/local/bin/gsed MAKE=gmake PKG_CONFIG=pkgconf XDG_DATA_HOME=/wrkdirs/usr/ports/java/openjdk12/work  XDG_CONFIG_HOME=/wrkdirs/usr/ports/java/openjdk12/work  HOME=/wrkdirs/usr/ports/java/openjdk12/work TMPDIR="/tmp" PATH=/wrkdirs/usr/ports/java/openjdk12/work/.bin:/sbin:/bin:/usr/sbin:/usr/bin:/usr/local/sbin:/usr/local/bin:/root/bin SHELL=/bin/sh CONFIG_SHELL=/bin/sh CONFIG_SITE=/usr/ports/Templates/config.site lt_cv_sys_max_cmd_len=524288
--End CONFIGURE_ENV--

--MAKE_ENV--
LANG="C"  LC_ALL="C"  CLASSPATH=""  JAVA_HOME=""  LD_LIBRARY_PATH=""  CC=cc  CXX=c++  CPP=cpp  MAKEFLAGS="" --with-toolchain-type=clang USE_CLANG=true XDG_DATA_HOME=/wrkdirs/usr/ports/java/openjdk12/work  XDG_CONFIG_HOME=/wrkdirs/usr/ports/java/openjdk12/work  HOME=/wrkdirs/usr/ports/java/openjdk12/work TMPDIR="/tmp" PATH=/wrkdirs/usr/ports/java/openjdk12/work/.bin:/sbin:/bin:/usr/sbin:/usr/bin:/usr/local/sbin:/usr/local/bin:/root/bin NO_PIE=yes MK_DEBUG_FILES=no MK_KERNEL_SYMBOLS=no SHELL=/bin/sh NO_LINT=YES PREFIX=/usr/local  LOCALBASE=/usr/local  CC="cc" CFLAGS="-O2 -pipe  -DLIBICONV_PLUG -fstack-protector-strong -fno-strict-aliasing "  CPP="cpp" CPPFLAGS="-DLIBICONV_PLUG"  LDFLAGS=" -fstack-protector-strong " LIBS=""  CXX="c++" CXXFLAGS="-O2 -pipe -DLIBICONV_PLUG -fstack-protector-strong -fno-strict-aliasing  -DLIBICONV_PLUG "  MANPREFIX="/usr/local" BSD_INSTALL_PROGRAM="install  -s -m 555"  BSD_INSTALL_LIB="install  -s -m 0644"  BSD_INSTALL_SCRIPT="install  -m 555"  BSD_INSTALL_
 DATA="install  -m 0644"  BSD_INSTALL_MAN="install  -m 444"
--End MAKE_ENV--

--PLIST_SUB--
OSREL=14.0 PREFIX=%D LOCALBASE=/usr/local  RESETPREFIX=/usr/local LIB32DIR=lib DOCSDIR="share/doc/openjdk"  EXAMPLESDIR="share/examples/openjdk"  DATADIR="share/openjdk"  WWWDIR="www/openjdk"  ETCDIR="etc/openjdk"
--End PLIST_SUB--

--SUB_LIST--
PREFIX=/usr/local LOCALBASE=/usr/local  DATADIR=/usr/local/share/openjdk DOCSDIR=/usr/local/share/doc/openjdk EXAMPLESDIR=/usr/local/share/examples/openjdk  WWWDIR=/usr/local/www/openjdk ETCDIR=/usr/local/etc/openjdk
--End SUB_LIST--

---Begin make.conf---
USE_PACKAGE_DEPENDS=yes
BATCH=yes
WRKDIRPREFIX=/wrkdirs
PORTSDIR=/usr/ports
PACKAGES=/packages
DISTDIR=/distfiles
PACKAGE_BUILDING=yes
PACKAGE_BUILDING_FLAVORS=yes
#### /usr/local/etc/poudriere.d/make.conf ####
# XXX: We really need this but cannot use it while 'make checksum' does not
# try the next mirror on checksum failure.  It currently retries the same
# failed mirror and then fails rather then trying another.  It *does*
# try the next if the size is mismatched though.
#MASTER_SITE_FREEBSD=yes
# Build ALLOW_MAKE_JOBS_PACKAGES with 2 jobs
MAKE_JOBS_NUMBER=2
#### /usr/ports/Mk/Scripts/ports_env.sh ####
_CCVERSION_921dbbb2=FreeBSD clang version 11.0.1 (git at github.com:llvm/llvm-project.git llvmorg-11.0.1-0-g43ff75f2c3fe) Target: aarch64-unknown-freebsd14.0 Thread model: posix InstalledDir: /usr/bin
_ALTCCVERSION_921dbbb2=none
_CXXINTERNAL_acaad9ca=FreeBSD clang version 11.0.1 (git at github.com:llvm/llvm-project.git llvmorg-11.0.1-0-g43ff75f2c3fe) Target: aarch64-unknown-freebsd14.0 Thread model: posix InstalledDir: /usr/bin "/usr/bin/ld" "--eh-frame-hdr" "-dynamic-linker" "/libexec/ld-elf.so.1" "--enable-new-dtags" "-o" "a.out" "/usr/lib/crt1.o" "/usr/lib/crti.o" "/usr/lib/crtbegin.o" "-L/usr/lib" "/dev/null" "-lc++" "-lm" "-lgcc" "--as-needed" "-lgcc_s" "--no-as-needed" "-lc" "-lgcc" "--as-needed" "-lgcc_s" "--no-as-needed" "/usr/lib/crtend.o" "/usr/lib/crtn.o"
CC_OUTPUT_921dbbb2_58173849=yes
CC_OUTPUT_921dbbb2_9bdba57c=yes
CC_OUTPUT_921dbbb2_6a4fe7f5=yes
CC_OUTPUT_921dbbb2_6bcac02b=yes
CC_OUTPUT_921dbbb2_67d20829=yes
CC_OUTPUT_921dbbb2_bfa62e83=yes
CC_OUTPUT_921dbbb2_f0b4d593=yes
CC_OUTPUT_921dbbb2_308abb44=yes
CC_OUTPUT_921dbbb2_f00456e5=yes
CC_OUTPUT_921dbbb2_65ad290d=yes
CC_OUTPUT_921dbbb2_f2776b26=yes
CC_OUTPUT_921dbbb2_b2657cc3=yes
CC_OUTPUT_921dbbb2_380987f7=yes
CC_OUTPUT_921dbbb2_160933ec=yes
CC_OUTPUT_921dbbb2_fb62803b=yes
_OBJC_CCVERSION_921dbbb2=FreeBSD clang version 11.0.1 (git at github.com:llvm/llvm-project.git llvmorg-11.0.1-0-g43ff75f2c3fe) Target: aarch64-unknown-freebsd14.0 Thread model: posix InstalledDir: /usr/bin
_OBJC_ALTCCVERSION_921dbbb2=none
ARCH=aarch64
OPSYS=FreeBSD
_OSRELEASE=14.0-CURRENT
OSREL=14.0
OSVERSION=1400003
PYTHONBASE=/usr/local
CONFIGURE_MAX_CMD_LEN=524288
HAVE_PORTS_ENV=1
#### Misc Poudriere ####
GID=0
UID=0
---End make.conf---
--Resource limits--
cpu time               (seconds, -t)  unlimited
file size           (512-blocks, -f)  unlimited
data seg size           (kbytes, -d)  1048576
stack size              (kbytes, -s)  1048576
core file size      (512-blocks, -c)  unlimited
max memory size         (kbytes, -m)  unlimited
locked memory           (kbytes, -l)  unlimited
max user processes              (-u)  34045
open files                      (-n)  1024
virtual mem size        (kbytes, -v)  unlimited
swap limit              (kbytes, -w)  unlimited
socket buffer size       (bytes, -b)  unlimited
pseudo-terminals                (-p)  unlimited
kqueues                         (-k)  unlimited
umtx shared locks               (-o)  unlimited
--End resource limits--
=======================<phase: check-sanity   >============================
===>  License GPLv2 accepted by the user
===========================================================================
=======================<phase: pkg-depends    >============================
===>   openjdk12-12.0.2+10.4_1 depends on file: /usr/local/sbin/pkg - not found
===>   Installing existing package /packages/All/pkg-1.16.2.txz
[main-arm64-default-job-05] Installing pkg-1.16.2...
[main-arm64-default-job-05] Extracting pkg-1.16.2: .......... done
===>   openjdk12-12.0.2+10.4_1 depends on file: /usr/local/sbin/pkg - found
===>   Returning to build of openjdk12-12.0.2+10.4_1
===========================================================================
=======================<phase: fetch-depends  >============================
===========================================================================
=======================<phase: fetch          >============================
===>  License GPLv2 accepted by the user
===> Fetching all distfiles required by openjdk12-12.0.2+10.4_1 for building
===========================================================================
=======================<phase: checksum       >============================
===>  License GPLv2 accepted by the user
===> Fetching all distfiles required by openjdk12-12.0.2+10.4_1 for building
=> SHA256 Checksum OK for battleblow-openjdk-jdk12u-jdk-12.0.2+10-4_GH0.tar.gz.
===========================================================================
=======================<phase: extract-depends>============================
===========================================================================
=======================<phase: extract        >============================
===>  License GPLv2 accepted by the user
===> Fetching all distfiles required by openjdk12-12.0.2+10.4_1 for building
===>  Extracting for openjdk12-12.0.2+10.4_1
=> SHA256 Checksum OK for battleblow-openjdk-jdk12u-jdk-12.0.2+10-4_GH0.tar.gz.
===========================================================================
=======================<phase: patch-depends  >============================
===========================================================================
=======================<phase: patch          >============================
===>  Patching for openjdk12-12.0.2+10.4_1
===>  Applying FreeBSD patches for openjdk12-12.0.2+10.4_1 from /usr/ports/java/openjdk12/files
===========================================================================
=======================<phase: build-depends  >============================
===>   openjdk12-12.0.2+10.4_1 depends on executable: zip - not found
===>   Installing existing package /packages/All/zip-3.0_1.txz
[main-arm64-default-job-05] Installing zip-3.0_1...
[main-arm64-default-job-05] Extracting zip-3.0_1: .......... done
===>   openjdk12-12.0.2+10.4_1 depends on executable: zip - found
===>   Returning to build of openjdk12-12.0.2+10.4_1
===>   openjdk12-12.0.2+10.4_1 depends on package: autoconf>0 - not found
===>   Installing existing package /packages/All/autoconf-2.69_3.txz
[main-arm64-default-job-05] Installing autoconf-2.69_3...
<snip>
Compiling 31 files for BUILD_JRTFS
Compiling 188 files for BUILD_jdk.rmic.interim
Compiling 2 files for COMPILE_DEPEND
Creating support/modules_libs/java.base/jrt-fs.jar
gmake[4]: Leaving directory '/wrkdirs/usr/ports/java/openjdk12/work/openjdk-jdk12u-jdk-12.0.2-10-4/make'
gmake[4]: Entering directory '/wrkdirs/usr/ports/java/openjdk12/work/openjdk-jdk12u-jdk-12.0.2-10-4/make/gensrc'
Note: Some input files use or override a deprecated API.
Note: Recompile with -Xlint:deprecation for details.
gmake[4]: Leaving directory '/wrkdirs/usr/ports/java/openjdk12/work/openjdk-jdk12u-jdk-12.0.2-10-4/make/gensrc'
gmake[4]: Leaving directory '/wrkdirs/usr/ports/java/openjdk12/work/openjdk-jdk12u-jdk-12.0.2-10-4/make'
Note: Some input files use or override a deprecated API.
Note: Recompile with -Xlint:deprecation for details.
Note: Some input files use unchecked or unsafe operations.
Note: Recompile with -Xlint:unchecked for details.
gmake[4]: Leaving directory '/wrkdirs/usr/ports/java/openjdk12/work/openjdk-jdk12u-jdk-12.0.2-10-4/make'
gmake[4]: Entering directory '/wrkdirs/usr/ports/java/openjdk12/work/openjdk-jdk12u-jdk-12.0.2-10-4/make/gensrc'
gmake[4]: Entering directory '/wrkdirs/usr/ports/java/openjdk12/work/openjdk-jdk12u-jdk-12.0.2-10-4/make'
gmake[4]: Entering directory '/wrkdirs/usr/ports/java/openjdk12/work/openjdk-jdk12u-jdk-12.0.2-10-4/make'
Compiling 2 files for BUILD_BREAKITERATOR_BASE
Compiling 2 files for BUILD_BREAKITERATOR_LD
gmake[4]: Leaving directory '/wrkdirs/usr/ports/java/openjdk12/work/openjdk-jdk12u-jdk-12.0.2-10-4/make'
gmake[4]: Entering directory '/wrkdirs/usr/ports/java/openjdk12/work/openjdk-jdk12u-jdk-12.0.2-10-4/make/gensrc'
Compiling 11 properties into resource bundles for java.logging
gmake[4]: Leaving directory '/wrkdirs/usr/ports/java/openjdk12/work/openjdk-jdk12u-jdk-12.0.2-10-4/make/gensrc'
gmake[4]: Entering directory '/wrkdirs/usr/ports/java/openjdk12/work/openjdk-jdk12u-jdk-12.0.2-10-4/make/gensrc'
gmake[4]: Leaving directory '/wrkdirs/usr/ports/java/openjdk12/work/openjdk-jdk12u-jdk-12.0.2-10-4/make'
gmake[4]: Entering directory '/wrkdirs/usr/ports/java/openjdk12/work/openjdk-jdk12u-jdk-12.0.2-10-4/make/gensrc'
Compiling 11 properties into resource bundles for jdk.jartool
Compiling 11 properties into resource bundles for java.base
Compiling 6 properties into resource bundles for java.base
gmake[4]: Entering directory '/wrkdirs/usr/ports/java/openjdk12/work/openjdk-jdk12u-jdk-12.0.2-10-4/make/gensrc'
gmake[4]: Leaving directory '/wrkdirs/usr/ports/java/openjdk12/work/openjdk-jdk12u-jdk-12.0.2-10-4/make/gensrc'
Compiling 11 properties into resource bundles for jdk.management.agent
gmake[4]: Entering directory '/wrkdirs/usr/ports/java/openjdk12/work/openjdk-jdk12u-jdk-12.0.2-10-4/make/gensrc'
Compiling 3 properties into resource bundles for jdk.jdi
gmake[4]: Leaving directory '/wrkdirs/usr/ports/java/openjdk12/work/openjdk-jdk12u-jdk-12.0.2-10-4/make/gensrc'
gmake[4]: Entering directory '/wrkdirs/usr/ports/java/openjdk12/work/openjdk-jdk12u-jdk-12.0.2-10-4/make/gensrc'
gmake[4]: Leaving directory '/wrkdirs/usr/ports/java/openjdk12/work/openjdk-jdk12u-jdk-12.0.2-10-4/make/gensrc'
Compiling 4 properties into resource bundles for jdk.jlink
Compiling 3 properties into resource bundles for jdk.jlink
gmake[4]: Entering directory '/wrkdirs/usr/ports/java/openjdk12/work/openjdk-jdk12u-jdk-12.0.2-10-4/make/gensrc'
Compiling 1 properties into resource bundles for jdk.jlink
Compiling 224 properties into resource bundles for jdk.localedata
gmake[4]: Leaving directory '/wrkdirs/usr/ports/java/openjdk12/work/openjdk-jdk12u-jdk-12.0.2-10-4/make/gensrc'
gmake[4]: Leaving directory '/wrkdirs/usr/ports/java/openjdk12/work/openjdk-jdk12u-jdk-12.0.2-10-4/make/gensrc'
gmake[4]: Entering directory '/wrkdirs/usr/ports/java/openjdk12/work/openjdk-jdk12u-jdk-12.0.2-10-4/make/gensrc'
gmake[4]: Leaving directory '/wrkdirs/usr/ports/java/openjdk12/work/openjdk-jdk12u-jdk-12.0.2-10-4/make/gensrc'
gmake[4]: Entering directory '/wrkdirs/usr/ports/java/openjdk12/work/openjdk-jdk12u-jdk-12.0.2-10-4/make'
gmake[4]: Entering directory '/wrkdirs/usr/ports/java/openjdk12/work/openjdk-jdk12u-jdk-12.0.2-10-4/make'
Compiling 67 files for COMPILE_CREATE_SYMBOLS
gmake[4]: Leaving directory '/wrkdirs/usr/ports/java/openjdk12/work/openjdk-jdk12u-jdk-12.0.2-10-4/make'
Creating ct.sym classes
gmake[4]: Leaving directory '/wrkdirs/usr/ports/java/openjdk12/work/openjdk-jdk12u-jdk-12.0.2-10-4/make/gensrc'
gmake[4]: Entering directory '/wrkdirs/usr/ports/java/openjdk12/work/openjdk-jdk12u-jdk-12.0.2-10-4/make'
gmake[4]: Entering directory '/wrkdirs/usr/ports/java/openjdk12/work/openjdk-jdk12u-jdk-12.0.2-10-4/make/gensrc'
Compiling 89 properties into resource bundles for java.desktop
Compiling 3023 files for java.base
Creating support/symbols/ct.sym
gmake[4]: Leaving directory '/wrkdirs/usr/ports/java/openjdk12/work/openjdk-jdk12u-jdk-12.0.2-10-4/make'
gmake[4]: Leaving directory '/wrkdirs/usr/ports/java/openjdk12/work/openjdk-jdk12u-jdk-12.0.2-10-4/make/gensrc'
gmake[4]: Leaving directory '/wrkdirs/usr/ports/java/openjdk12/work/openjdk-jdk12u-jdk-12.0.2-10-4/make/gensrc'
c++: warning: argument unused during compilation: '-static-libstdc++' [-Wunused-command-line-argument]
c++: warning: argument unused during compilation: '-static-libgcc' [-Wunused-command-line-argument]
gmake[4]: Leaving directory '/wrkdirs/usr/ports/java/openjdk12/work/openjdk-jdk12u-jdk-12.0.2-10-4/make/hotspot'
gmake[4]: Leaving directory '/wrkdirs/usr/ports/java/openjdk12/work/openjdk-jdk12u-jdk-12.0.2-10-4/make'
gmake[4]: Entering directory '/wrkdirs/usr/ports/java/openjdk12/work/openjdk-jdk12u-jdk-12.0.2-10-4/make'
gmake[4]: Entering directory '/wrkdirs/usr/ports/java/openjdk12/work/openjdk-jdk12u-jdk-12.0.2-10-4/make'
gmake[4]: Entering directory '/wrkdirs/usr/ports/java/openjdk12/work/openjdk-jdk12u-jdk-12.0.2-10-4/make'
gmake[4]: Entering directory '/wrkdirs/usr/ports/java/openjdk12/work/openjdk-jdk12u-jdk-12.0.2-10-4/make'
gmake[4]: Entering directory '/wrkdirs/usr/ports/java/openjdk12/work/openjdk-jdk12u-jdk-12.0.2-10-4/make'
gmake[4]: Entering directory '/wrkdirs/usr/ports/java/openjdk12/work/openjdk-jdk12u-jdk-12.0.2-10-4/make'
gmake[4]: Entering directory '/wrkdirs/usr/ports/java/openjdk12/work/openjdk-jdk12u-jdk-12.0.2-10-4/make'
gmake[4]: Entering directory '/wrkdirs/usr/ports/java/openjdk12/work/openjdk-jdk12u-jdk-12.0.2-10-4/make'
gmake[4]: Entering directory '/wrkdirs/usr/ports/java/openjdk12/work/openjdk-jdk12u-jdk-12.0.2-10-4/make'
gmake[4]: Entering directory '/wrkdirs/usr/ports/java/openjdk12/work/openjdk-jdk12u-jdk-12.0.2-10-4/make'
gmake[4]: Entering directory '/wrkdirs/usr/ports/java/openjdk12/work/openjdk-jdk12u-jdk-12.0.2-10-4/make'
gmake[4]: Entering directory '/wrkdirs/usr/ports/java/openjdk12/work/openjdk-jdk12u-jdk-12.0.2-10-4/make'
gmake[4]: Entering directory '/wrkdirs/usr/ports/java/openjdk12/work/openjdk-jdk12u-jdk-12.0.2-10-4/make'
gmake[4]: Entering directory '/wrkdirs/usr/ports/java/openjdk12/work/openjdk-jdk12u-jdk-12.0.2-10-4/make'
gmake[4]: Entering directory '/wrkdirs/usr/ports/java/openjdk12/work/openjdk-jdk12u-jdk-12.0.2-10-4/make'
gmake[4]: Entering directory '/wrkdirs/usr/ports/java/openjdk12/work/openjdk-jdk12u-jdk-12.0.2-10-4/make'
gmake[4]: Entering directory '/wrkdirs/usr/ports/java/openjdk12/work/openjdk-jdk12u-jdk-12.0.2-10-4/make'
gmake[4]: Entering directory '/wrkdirs/usr/ports/java/openjdk12/work/openjdk-jdk12u-jdk-12.0.2-10-4/make'
gmake[4]: Entering directory '/wrkdirs/usr/ports/java/openjdk12/work/openjdk-jdk12u-jdk-12.0.2-10-4/make'
gmake[4]: Entering directory '/wrkdirs/usr/ports/java/openjdk12/work/openjdk-jdk12u-jdk-12.0.2-10-4/make'
gmake[4]: Entering directory '/wrkdirs/usr/ports/java/openjdk12/work/openjdk-jdk12u-jdk-12.0.2-10-4/make'
gmake[4]: Entering directory '/wrkdirs/usr/ports/java/openjdk12/work/openjdk-jdk12u-jdk-12.0.2-10-4/make'
gmake[4]: Entering directory '/wrkdirs/usr/ports/java/openjdk12/work/openjdk-jdk12u-jdk-12.0.2-10-4/make'
gmake[4]: Entering directory '/wrkdirs/usr/ports/java/openjdk12/work/openjdk-jdk12u-jdk-12.0.2-10-4/make'
gmake[4]: Entering directory '/wrkdirs/usr/ports/java/openjdk12/work/openjdk-jdk12u-jdk-12.0.2-10-4/make'
gmake[4]: Entering directory '/wrkdirs/usr/ports/java/openjdk12/work/openjdk-jdk12u-jdk-12.0.2-10-4/make'
gmake[4]: Entering directory '/wrkdirs/usr/ports/java/openjdk12/work/openjdk-jdk12u-jdk-12.0.2-10-4/make'
gmake[4]: Entering directory '/wrkdirs/usr/ports/java/openjdk12/work/openjdk-jdk12u-jdk-12.0.2-10-4/make'
Compiling 5 files for java.transaction.xa
Compiling 22 files for jdk.crypto.ec
Compiling 10 files for java.instrument
Compiling 22 files for java.smartcardio
Compiling 1 files for jdk.pack
Compiling 44 files for jdk.httpserver
Compiling 3 files for jdk.internal.ed
Compiling 9 files for jdk.net
Compiling 35 files for java.logging
Compiling 9 files for jdk.unsupported
Compiling 1 files for jdk.jdwp.agent
Compiling 33 files for jdk.jartool
Compiling 18 files for java.datatransfer
Compiling 15 files for jdk.zipfsCompiling 15 files for java.scripting
Compiling 140 files for java.net.http

Compiling 117 files for java.compiler
Compiling 33 files for jdk.sctp
Compiling 60 files for jdk.internal.jvmstat
Compiling 193 files for jdk.internal.vm.ci
Compiling 175 files for jdk.jfrCompiling 119 files for jdk.charsets

Compiling 51 files for jdk.internal.opt
Compiling 330 files for java.management
Compiling 97 files for jdk.internal.le
Compiling 1703 files for jdk.localedata
Creating support/modules_libs/java.base/libverify.so from 2 file(s)
Creating support/modules_libs/java.base/libjava.so from 58 file(s)
Creating support/native/java.base/libfdlibm.a from 57 file(s)
Creating support/modules_libs/java.base/libzip.so from 5 file(s)
Creating support/modules_libs/java.base/libjimage.so from 6 file(s)
Creating support/modules_libs/java.base/libjli.so from 8 file(s)
Creating support/modules_libs/java.base/libnet.so from 21 file(s)
Creating support/modules_libs/java.base/libnio.so from 21 file(s)
Creating support/modules_libs/java.base/libjsig.so from 1 file(s)
gmake[4]: Leaving directory '/wrkdirs/usr/ports/java/openjdk12/work/openjdk-jdk12u-jdk-12.0.2-10-4/make'
gmake[4]: Leaving directory '/wrkdirs/usr/ports/java/openjdk12/work/openjdk-jdk12u-jdk-12.0.2-10-4/make'
gmake[4]: Leaving directory '/wrkdirs/usr/ports/java/openjdk12/work/openjdk-jdk12u-jdk-12.0.2-10-4/make'
gmake[4]: Leaving directory '/wrkdirs/usr/ports/java/openjdk12/work/openjdk-jdk12u-jdk-12.0.2-10-4/make'
Compiling 1831 files for java.xml
gmake[4]: Leaving directory '/wrkdirs/usr/ports/java/openjdk12/work/openjdk-jdk12u-jdk-12.0.2-10-4/make'
gmake[4]: Leaving directory '/wrkdirs/usr/ports/java/openjdk12/work/openjdk-jdk12u-jdk-12.0.2-10-4/make'
gmake[4]: Leaving directory '/wrkdirs/usr/ports/java/openjdk12/work/openjdk-jdk12u-jdk-12.0.2-10-4/make'
gmake[4]: Leaving directory '/wrkdirs/usr/ports/java/openjdk12/work/openjdk-jdk12u-jdk-12.0.2-10-4/make'
gmake[4]: Leaving directory '/wrkdirs/usr/ports/java/openjdk12/work/openjdk-jdk12u-jdk-12.0.2-10-4/make'
gmake[4]: Leaving directory '/wrkdirs/usr/ports/java/openjdk12/work/openjdk-jdk12u-jdk-12.0.2-10-4/make'
ld: error: duplicate symbol: parentPathv
>>> defined at ProcessImpl_md.c
>>>            /wrkdirs/usr/ports/java/openjdk12/work/openjdk-jdk12u-jdk-12.0.2-10-4/build/bsd-aarch64-server-release/support/native/java.base/libjava/ProcessImpl_md.o:(parentPathv)
>>> defined at childproc.c
>>>            /wrkdirs/usr/ports/java/openjdk12/work/openjdk-jdk12u-jdk-12.0.2-10-4/build/bsd-aarch64-server-release/support/native/java.base/libjava/childproc.o:(.bss+0x0)
cc: error: linker command failed with exit code 1 (use -v to see invocation)
gmake[4]: *** [CoreLibraries.gmk:102: /wrkdirs/usr/ports/java/openjdk12/work/openjdk-jdk12u-jdk-12.0.2-10-4/build/bsd-aarch64-server-release/support/modules_libs/java.base/libjava.so] Error 1
gmake[4]: *** Waiting for unfinished jobs....
gmake[4]: Leaving directory '/wrkdirs/usr/ports/java/openjdk12/work/openjdk-jdk12u-jdk-12.0.2-10-4/make'
gmake[4]: Leaving directory '/wrkdirs/usr/ports/java/openjdk12/work/openjdk-jdk12u-jdk-12.0.2-10-4/make'
gmake[3]: *** [make/Main.gmk:215: java.base-libs] Error 2
gmake[3]: *** Waiting for unfinished jobs....
gmake[4]: Leaving directory '/wrkdirs/usr/ports/java/openjdk12/work/openjdk-jdk12u-jdk-12.0.2-10-4/make'
gmake[4]: Leaving directory '/wrkdirs/usr/ports/java/openjdk12/work/openjdk-jdk12u-jdk-12.0.2-10-4/make'
gmake[4]: Leaving directory '/wrkdirs/usr/ports/java/openjdk12/work/openjdk-jdk12u-jdk-12.0.2-10-4/make'
gmake[4]: Leaving directory '/wrkdirs/usr/ports/java/openjdk12/work/openjdk-jdk12u-jdk-12.0.2-10-4/make'
gmake[4]: Leaving directory '/wrkdirs/usr/ports/java/openjdk12/work/openjdk-jdk12u-jdk-12.0.2-10-4/make'
gmake[4]: Leaving directory '/wrkdirs/usr/ports/java/openjdk12/work/openjdk-jdk12u-jdk-12.0.2-10-4/make'
gmake[4]: Leaving directory '/wrkdirs/usr/ports/java/openjdk12/work/openjdk-jdk12u-jdk-12.0.2-10-4/make'
gmake[4]: Leaving directory '/wrkdirs/usr/ports/java/openjdk12/work/openjdk-jdk12u-jdk-12.0.2-10-4/make'
gmake[4]: Leaving directory '/wrkdirs/usr/ports/java/openjdk12/work/openjdk-jdk12u-jdk-12.0.2-10-4/make'
gmake[4]: Leaving directory '/wrkdirs/usr/ports/java/openjdk12/work/openjdk-jdk12u-jdk-12.0.2-10-4/make'
gmake[4]: Leaving directory '/wrkdirs/usr/ports/java/openjdk12/work/openjdk-jdk12u-jdk-12.0.2-10-4/make'
gmake[4]: Leaving directory '/wrkdirs/usr/ports/java/openjdk12/work/openjdk-jdk12u-jdk-12.0.2-10-4/make'
gmake[4]: Leaving directory '/wrkdirs/usr/ports/java/openjdk12/work/openjdk-jdk12u-jdk-12.0.2-10-4/make'
gmake[4]: Leaving directory '/wrkdirs/usr/ports/java/openjdk12/work/openjdk-jdk12u-jdk-12.0.2-10-4/make'
gmake[4]: Leaving directory '/wrkdirs/usr/ports/java/openjdk12/work/openjdk-jdk12u-jdk-12.0.2-10-4/make'
gmake[4]: Leaving directory '/wrkdirs/usr/ports/java/openjdk12/work/openjdk-jdk12u-jdk-12.0.2-10-4/make'
gmake[3]: Leaving directory '/wrkdirs/usr/ports/java/openjdk12/work/openjdk-jdk12u-jdk-12.0.2-10-4'

ERROR: Build failed for target 'images' in configuration 'bsd-aarch64-server-release' (exit code 2) 
gmake[3]: Entering directory '/wrkdirs/usr/ports/java/openjdk12/work/openjdk-jdk12u-jdk-12.0.2-10-4'

=== Output from failing command(s) repeated here ===
* For target support_native_java.base_libjava_BUILD_LIBJAVA_link:
ld: error: duplicate symbol: parentPathv
>>> defined at ProcessImpl_md.c
>>>            /wrkdirs/usr/ports/java/openjdk12/work/openjdk-jdk12u-jdk-12.0.2-10-4/build/bsd-aarch64-server-release/support/native/java.base/libjava/ProcessImpl_md.o:(parentPathv)
>>> defined at childproc.c
>>>            /wrkdirs/usr/ports/java/openjdk12/work/openjdk-jdk12u-jdk-12.0.2-10-4/build/bsd-aarch64-server-release/support/native/java.base/libjava/childproc.o:(.bss+0x0)
cc: error: linker command failed with exit code 1 (use -v to see invocation)

* All command lines available in /wrkdirs/usr/ports/java/openjdk12/work/openjdk-jdk12u-jdk-12.0.2-10-4/build/bsd-aarch64-server-release/make-support/failure-logs.
=== End of repeated output ===

No indication of failed target found.
Hint: Try searching the build log for '] Error'.
Hint: See doc/building.html#troubleshooting for assistance.

gmake[3]: Leaving directory '/wrkdirs/usr/ports/java/openjdk12/work/openjdk-jdk12u-jdk-12.0.2-10-4'
gmake[2]: *** [/wrkdirs/usr/ports/java/openjdk12/work/openjdk-jdk12u-jdk-12.0.2-10-4/make/Init.gmk:310: main] Error 2
gmake[2]: Leaving directory '/wrkdirs/usr/ports/java/openjdk12/work/openjdk-jdk12u-jdk-12.0.2-10-4'
gmake[1]: *** [/wrkdirs/usr/ports/java/openjdk12/work/openjdk-jdk12u-jdk-12.0.2-10-4/make/Init.gmk:186: images] Error 2
gmake[1]: Leaving directory '/wrkdirs/usr/ports/java/openjdk12/work/openjdk-jdk12u-jdk-12.0.2-10-4'
===> Compilation failed unexpectedly.
Try to set MAKE_JOBS_UNSAFE=yes and rebuild before reporting the failure to
the maintainer.
*** Error code 1

Stop.
make: stopped in /usr/ports/java/openjdk12


More information about the freebsd-pkg-fallout mailing list