[package - 13stable-arm64-quarterly][graphics/drm-devel-kmod] Failed for drm-devel-kmod-5.4.62.g20201109 in build
pkg-fallout at FreeBSD.org
pkg-fallout at FreeBSD.org
Thu Jan 28 05:27:32 UTC 2021
You are receiving this mail as a port that you maintain
is failing to build on the FreeBSD package build server.
Please investigate the failure and submit a PR to fix
build.
Maintainer: x11 at FreeBSD.org
Last committer: rene at FreeBSD.org
Ident: $FreeBSD: branches/2021Q1/graphics/drm-devel-kmod/Makefile 562492 2021-01-24 17:18:24Z rene $
Log URL: http://ampere1.nyi.freebsd.org/data/13stable-arm64-quarterly/562611/logs/drm-devel-kmod-5.4.62.g20201109.log
Build URL: http://ampere1.nyi.freebsd.org/build.html?mastername=13stable-arm64-quarterly&build=562611
Log:
=>> Building graphics/drm-devel-kmod
build started at Thu Jan 28 05:27:15 UTC 2021
port directory: /usr/ports/graphics/drm-devel-kmod
package name: drm-devel-kmod-5.4.62.g20201109
building for: FreeBSD 13stable-arm64-quarterly-job-13 13.0-ALPHA2 FreeBSD 13.0-ALPHA2 1300136 arm64
maintained by: x11 at FreeBSD.org
Makefile ident: $FreeBSD: branches/2021Q1/graphics/drm-devel-kmod/Makefile 562492 2021-01-24 17:18:24Z rene $
Poudriere version: 3.2.8-8-gaf08dbda
Host OSVERSION: 1300134
Jail OSVERSION: 1300136
Job Id: 13
!!! Jail is newer than host. (Jail: 1300136, Host: 1300134) !!!
!!! This is not supported. !!!
!!! Host kernel must be same or newer than jail. !!!
!!! Expect build failures. !!!
---Begin Environment---
SHELL=/bin/csh
OSVERSION=1300136
UNAME_v=FreeBSD 13.0-ALPHA2 1300136
UNAME_r=13.0-ALPHA2
BLOCKSIZE=K
MAIL=/var/mail/root
MM_CHARSET=UTF-8
LANG=C.UTF-8
STATUS=1
HOME=/root
PATH=/sbin:/bin:/usr/sbin:/usr/bin:/usr/local/sbin:/usr/local/bin:/root/bin
LOCALBASE=/usr/local
USER=root
LIBEXECPREFIX=/usr/local/libexec/poudriere
POUDRIERE_VERSION=3.2.8-8-gaf08dbda
MASTERMNT=/usr/local/poudriere/data/.m/13stable-arm64-quarterly/ref
POUDRIERE_BUILD_TYPE=bulk
PACKAGE_BUILDING=yes
SAVED_TERM=
PWD=/usr/local/poudriere/data/.m/13stable-arm64-quarterly/ref/.p/pool
P_PORTS_FEATURES=FLAVORS SELECTED_OPTIONS
MASTERNAME=13stable-arm64-quarterly
SCRIPTPREFIX=/usr/local/share/poudriere
OLDPWD=/usr/local/poudriere/data/.m/13stable-arm64-quarterly/ref/.p
SCRIPTPATH=/usr/local/share/poudriere/bulk.sh
POUDRIEREPATH=/usr/local/bin/poudriere
---End Environment---
---Begin Poudriere Port Flags/Env---
PORT_FLAGS=
PKGENV=
FLAVOR=
DEPENDS_ARGS=
MAKE_ARGS=
---End Poudriere Port Flags/Env---
---Begin OPTIONS List---
===> The following configuration options are available for drm-devel-kmod-5.4.62.g20201109:
DEBUG=off: Build with debugging support
===> Use 'make config' to modify these settings
---End OPTIONS List---
--MAINTAINER--
x11 at FreeBSD.org
--End MAINTAINER--
--CONFIGURE_ARGS--
--End CONFIGURE_ARGS--
--CONFIGURE_ENV--
XDG_DATA_HOME=/wrkdirs/usr/ports/graphics/drm-devel-kmod/work XDG_CONFIG_HOME=/wrkdirs/usr/ports/graphics/drm-devel-kmod/work HOME=/wrkdirs/usr/ports/graphics/drm-devel-kmod/work TMPDIR="/tmp" PATH=/wrkdirs/usr/ports/graphics/drm-devel-kmod/work/.bin:/sbin:/bin:/usr/sbin:/usr/bin:/usr/local/sbin:/usr/local/bin:/root/bin SHELL=/bin/sh CONFIG_SHELL=/bin/sh
--End CONFIGURE_ENV--
--MAKE_ENV--
KMODDIR="/boot/modules" SYSDIR="/usr/src/sys" NO_XREF=yes XDG_DATA_HOME=/wrkdirs/usr/ports/graphics/drm-devel-kmod/work XDG_CONFIG_HOME=/wrkdirs/usr/ports/graphics/drm-devel-kmod/work HOME=/wrkdirs/usr/ports/graphics/drm-devel-kmod/work TMPDIR="/tmp" PATH=/wrkdirs/usr/ports/graphics/drm-devel-kmod/work/.bin:/sbin:/bin:/usr/sbin:/usr/bin:/usr/local/sbin:/usr/local/bin:/root/bin NO_PIE=yes MK_DEBUG_FILES=no MK_KERNEL_SYMBOLS=no SHELL=/bin/sh NO_LINT=YES PREFIX=/usr/local LOCALBASE=/usr/local CC="cc" CFLAGS="-O2 -pipe -fno-strict-aliasing " CPP="cpp" CPPFLAGS="" LDFLAGS=" " LIBS="" CXX="c++" CXXFLAGS="-O2 -pipe -fno-strict-aliasing " MANPREFIX="/usr/local" BSD_INSTALL_PROGRAM="install -s -m 555" BSD_INSTALL_LIB="install -s -m 0644" BSD_INSTALL_SCRIPT="install -m 555" BSD_INSTALL_DATA="install -m 0644" BSD_INSTALL_MAN="install -m 444"
--End MAKE_ENV--
--PLIST_SUB--
AMDGPU="" AMDKFD="@comment " I915="@comment " VBOXVIDEO="@comment " VMWGFX="@comment " KMODDIR="boot/modules" OSREL=13.0 PREFIX=%D LOCALBASE=/usr/local RESETPREFIX=/usr/local LIB32DIR=lib DOCSDIR="share/doc/drm-devel-kmod" EXAMPLESDIR="share/examples/drm-devel-kmod" DATADIR="share/drm-devel-kmod" WWWDIR="www/drm-devel-kmod" ETCDIR="etc/drm-devel-kmod"
--End PLIST_SUB--
--SUB_LIST--
PREFIX=/usr/local LOCALBASE=/usr/local DATADIR=/usr/local/share/drm-devel-kmod DOCSDIR=/usr/local/share/doc/drm-devel-kmod EXAMPLESDIR=/usr/local/share/examples/drm-devel-kmod WWWDIR=/usr/local/www/drm-devel-kmod ETCDIR=/usr/local/etc/drm-devel-kmod
--End SUB_LIST--
---Begin make.conf---
USE_PACKAGE_DEPENDS=yes
BATCH=yes
WRKDIRPREFIX=/wrkdirs
PORTSDIR=/usr/ports
PACKAGES=/packages
DISTDIR=/distfiles
PACKAGE_BUILDING=yes
PACKAGE_BUILDING_FLAVORS=yes
#### /usr/local/etc/poudriere.d/make.conf ####
# XXX: We really need this but cannot use it while 'make checksum' does not
# try the next mirror on checksum failure. It currently retries the same
# failed mirror and then fails rather then trying another. It *does*
# try the next if the size is mismatched though.
#MASTER_SITE_FREEBSD=yes
# Build ALLOW_MAKE_JOBS_PACKAGES with 2 jobs
MAKE_JOBS_NUMBER=2
#### /usr/ports/Mk/Scripts/ports_env.sh ####
_CCVERSION_921dbbb2=FreeBSD clang version 11.0.1 (git at github.com:llvm/llvm-project.git llvmorg-11.0.1-0-g43ff75f2c3fe) Target: aarch64-unknown-freebsd13.0 Thread model: posix InstalledDir: /usr/bin
_ALTCCVERSION_921dbbb2=none
_CXXINTERNAL_acaad9ca=FreeBSD clang version 11.0.1 (git at github.com:llvm/llvm-project.git llvmorg-11.0.1-0-g43ff75f2c3fe) Target: aarch64-unknown-freebsd13.0 Thread model: posix InstalledDir: /usr/bin "/usr/bin/ld" "--eh-frame-hdr" "-dynamic-linker" "/libexec/ld-elf.so.1" "--enable-new-dtags" "-o" "a.out" "/usr/lib/crt1.o" "/usr/lib/crti.o" "/usr/lib/crtbegin.o" "-L/usr/lib" "/dev/null" "-lc++" "-lm" "-lgcc" "--as-needed" "-lgcc_s" "--no-as-needed" "-lc" "-lgcc" "--as-needed" "-lgcc_s" "--no-as-needed" "/usr/lib/crtend.o" "/usr/lib/crtn.o"
CC_OUTPUT_921dbbb2_58173849=yes
CC_OUTPUT_921dbbb2_9bdba57c=yes
CC_OUTPUT_921dbbb2_6a4fe7f5=yes
CC_OUTPUT_921dbbb2_6bcac02b=yes
CC_OUTPUT_921dbbb2_67d20829=yes
CC_OUTPUT_921dbbb2_bfa62e83=yes
CC_OUTPUT_921dbbb2_f0b4d593=yes
CC_OUTPUT_921dbbb2_308abb44=yes
CC_OUTPUT_921dbbb2_f00456e5=yes
CC_OUTPUT_921dbbb2_65ad290d=yes
CC_OUTPUT_921dbbb2_f2776b26=yes
CC_OUTPUT_921dbbb2_b2657cc3=yes
CC_OUTPUT_921dbbb2_380987f7=yes
CC_OUTPUT_921dbbb2_160933ec=yes
CC_OUTPUT_921dbbb2_fb62803b=yes
_OBJC_CCVERSION_921dbbb2=FreeBSD clang version 11.0.1 (git at github.com:llvm/llvm-project.git llvmorg-11.0.1-0-g43ff75f2c3fe) Target: aarch64-unknown-freebsd13.0 Thread model: posix InstalledDir: /usr/bin
_OBJC_ALTCCVERSION_921dbbb2=none
ARCH=aarch64
OPSYS=FreeBSD
_OSRELEASE=13.0-ALPHA2
OSREL=13.0
OSVERSION=1300136
PYTHONBASE=/usr/local
CONFIGURE_MAX_CMD_LEN=524288
HAVE_PORTS_ENV=1
#### Misc Poudriere ####
GID=0
UID=0
---End make.conf---
--Resource limits--
cpu time (seconds, -t) unlimited
file size (512-blocks, -f) unlimited
data seg size (kbytes, -d) 1048576
stack size (kbytes, -s) 1048576
core file size (512-blocks, -c) unlimited
max memory size (kbytes, -m) unlimited
locked memory (kbytes, -l) unlimited
max user processes (-u) 89999
open files (-n) 1024
virtual mem size (kbytes, -v) unlimited
swap limit (kbytes, -w) unlimited
socket buffer size (bytes, -b) unlimited
pseudo-terminals (-p) unlimited
kqueues (-k) unlimited
umtx shared locks (-o) unlimited
--End resource limits--
=======================<phase: check-sanity >============================
===> License BSD2CLAUSE MIT GPLv2 accepted by the user
===========================================================================
=======================<phase: pkg-depends >============================
===> drm-devel-kmod-5.4.62.g20201109 depends on file: /usr/local/sbin/pkg - not found
===> Installing existing package /packages/All/pkg-1.16.1.txz
[13stable-arm64-quarterly-job-13] Installing pkg-1.16.1...
[13stable-arm64-quarterly-job-13] Extracting pkg-1.16.1: .......... done
===> drm-devel-kmod-5.4.62.g20201109 depends on file: /usr/local/sbin/pkg - found
===> Returning to build of drm-devel-kmod-5.4.62.g20201109
===========================================================================
=======================<phase: fetch-depends >============================
===========================================================================
=======================<phase: fetch >============================
===> License BSD2CLAUSE MIT GPLv2 accepted by the user
=> freebsd-drm-kmod-5.4.62.g20201109-drm_v5.4.62_4_GH0.tar.gz doesn't seem to exist in /portdistfiles/.
=> Attempting to fetch https://codeload.github.com/freebsd/drm-kmod/tar.gz/drm_v5.4.62_4?dummy=/freebsd-drm-kmod-5.4.62.g20201109-drm_v5.4.62_4_GH0.tar.gz
fetch: https://codeload.github.com/freebsd/drm-kmod/tar.gz/drm_v5.4.62_4?dummy=/freebsd-drm-kmod-5.4.62.g20201109-drm_v5.4.62_4_GH0.tar.gz: size unknown
fetch: https://codeload.github.com/freebsd/drm-kmod/tar.gz/drm_v5.4.62_4?dummy=/freebsd-drm-kmod-5.4.62.g20201109-drm_v5.4.62_4_GH0.tar.gz: size of remote file is not known
freebsd-drm-kmod-5.4.62.g20201109-drm_v5.4.62_4_GH0.tar.gz 17 MB 4149 kBps 05s
===> Fetching all distfiles required by drm-devel-kmod-5.4.62.g20201109 for building
===========================================================================
=======================<phase: checksum >============================
===> License BSD2CLAUSE MIT GPLv2 accepted by the user
===> Fetching all distfiles required by drm-devel-kmod-5.4.62.g20201109 for building
=> SHA256 Checksum OK for freebsd-drm-kmod-5.4.62.g20201109-drm_v5.4.62_4_GH0.tar.gz.
===========================================================================
=======================<phase: extract-depends>============================
===========================================================================
=======================<phase: extract >============================
===> License BSD2CLAUSE MIT GPLv2 accepted by the user
===> Fetching all distfiles required by drm-devel-kmod-5.4.62.g20201109 for building
===> Extracting for drm-devel-kmod-5.4.62.g20201109
=> SHA256 Checksum OK for freebsd-drm-kmod-5.4.62.g20201109-drm_v5.4.62_4_GH0.tar.gz.
===========================================================================
=======================<phase: patch-depends >============================
===========================================================================
=======================<phase: patch >============================
===> Patching for drm-devel-kmod-5.4.62.g20201109
===========================================================================
=======================<phase: build-depends >============================
===========================================================================
=======================<phase: lib-depends >============================
<snip>
^
/usr/src/sys/compat/linuxkpi/common/include/linux/string.h:94:8: error: implicit declaration of function 'kmalloc' is invalid in C99 [-Werror,-Wimplicit-function-declaration]
dst = kmalloc(len, gfp);
^
/usr/src/sys/compat/linuxkpi/common/include/linux/string.h:94:8: note: did you mean 'malloc'?
/usr/src/sys/sys/malloc.h:190:7: note: 'malloc' declared here
void *malloc(size_t size, struct malloc_type *type, int flags) __malloc_like
^
In file included from /wrkdirs/usr/ports/graphics/drm-devel-kmod/work/drm-kmod-drm_v5.4.62_4/linuxkpi/gplv2/src/linux_compat.c:10:
In file included from /wrkdirs/usr/ports/graphics/drm-devel-kmod/work/drm-kmod-drm_v5.4.62_4/linuxkpi/gplv2/include/linux/pci.h:10:
In file included from /usr/src/sys/compat/linuxkpi/common/include/linux/pci.h:51:
In file included from /usr/src/sys/compat/linuxkpi/common/include/linux/dmapool.h:36:
In file included from /wrkdirs/usr/ports/graphics/drm-devel-kmod/work/drm-kmod-drm_v5.4.62_4/linuxkpi/gplv2/include/linux/scatterlist.h:32:
In file included from /usr/src/sys/compat/linuxkpi/common/include/linux/scatterlist.h:36:
In file included from /usr/src/sys/compat/linuxkpi/common/include/linux/slab.h:43:
In file included from /wrkdirs/usr/ports/graphics/drm-devel-kmod/work/drm-kmod-drm_v5.4.62_4/linuxkpi/gplv2/include/linux/llist.h:64:
In file included from /wrkdirs/usr/ports/graphics/drm-devel-kmod/work/drm-kmod-drm_v5.4.62_4/linuxkpi/gplv2/include/linux/kernel.h:4:
In file included from /usr/src/sys/compat/linuxkpi/common/include/linux/kernel.h:49:
In file included from /wrkdirs/usr/ports/graphics/drm-devel-kmod/work/drm-kmod-drm_v5.4.62_4/linuxkpi/gplv2/include/linux/sched.h:4:
In file included from /usr/src/sys/compat/linuxkpi/common/include/linux/sched.h:47:
/usr/src/sys/compat/linuxkpi/common/include/linux/string.h:94:6: error: incompatible integer to pointer conversion assigning to 'void *' from 'int' [-Werror,-Wint-conversion]
dst = kmalloc(len, gfp);
^ ~~~~~~~~~~~~~~~~~
/usr/src/sys/compat/linuxkpi/common/include/linux/string.h:109:11: error: implicit declaration of function 'kmalloc' is invalid in C99 [-Werror,-Wimplicit-function-declaration]
retval = kmalloc(len, gfp);
^
/usr/src/sys/compat/linuxkpi/common/include/linux/string.h:109:9: error: incompatible integer to pointer conversion assigning to 'char *' from 'int' [-Werror,-Wint-conversion]
retval = kmalloc(len, gfp);
^ ~~~~~~~~~~~~~~~~~
/usr/src/sys/compat/linuxkpi/common/include/linux/string.h:122:11: error: implicit declaration of function 'kmalloc' is invalid in C99 [-Werror,-Wimplicit-function-declaration]
retval = kmalloc(len + 1, gfp);
^
/usr/src/sys/compat/linuxkpi/common/include/linux/string.h:122:9: error: incompatible integer to pointer conversion assigning to 'char *' from 'int' [-Werror,-Wint-conversion]
retval = kmalloc(len + 1, gfp);
^ ~~~~~~~~~~~~~~~~~~~~~
In file included from /wrkdirs/usr/ports/graphics/drm-devel-kmod/work/drm-kmod-drm_v5.4.62_4/linuxkpi/gplv2/src/linux_compat.c:10:
In file included from /wrkdirs/usr/ports/graphics/drm-devel-kmod/work/drm-kmod-drm_v5.4.62_4/linuxkpi/gplv2/include/linux/pci.h:10:
In file included from /usr/src/sys/compat/linuxkpi/common/include/linux/pci.h:51:
In file included from /usr/src/sys/compat/linuxkpi/common/include/linux/dmapool.h:36:
In file included from /wrkdirs/usr/ports/graphics/drm-devel-kmod/work/drm-kmod-drm_v5.4.62_4/linuxkpi/gplv2/include/linux/scatterlist.h:32:
In file included from /usr/src/sys/compat/linuxkpi/common/include/linux/scatterlist.h:36:
/usr/src/sys/compat/linuxkpi/common/include/linux/slab.h:124:1: error: static declaration of 'kmalloc' follows non-static declaration
kmalloc(size_t size, gfp_t flags)
^
/usr/src/sys/compat/linuxkpi/common/include/linux/string.h:94:8: note: previous implicit declaration is here
dst = kmalloc(len, gfp);
^
In file included from /wrkdirs/usr/ports/graphics/drm-devel-kmod/work/drm-kmod-drm_v5.4.62_4/linuxkpi/gplv2/src/linux_compat.c:10:
In file included from /wrkdirs/usr/ports/graphics/drm-devel-kmod/work/drm-kmod-drm_v5.4.62_4/linuxkpi/gplv2/include/linux/pci.h:10:
In file included from /usr/src/sys/compat/linuxkpi/common/include/linux/pci.h:51:
In file included from /usr/src/sys/compat/linuxkpi/common/include/linux/dmapool.h:36:
In file included from /wrkdirs/usr/ports/graphics/drm-devel-kmod/work/drm-kmod-drm_v5.4.62_4/linuxkpi/gplv2/include/linux/scatterlist.h:32:
In file included from /usr/src/sys/compat/linuxkpi/common/include/linux/scatterlist.h:36:
/usr/src/sys/compat/linuxkpi/common/include/linux/slab.h:149:1: error: static declaration of 'kmalloc_array' follows non-static declaration
kmalloc_array(size_t n, size_t size, gfp_t flags)
^
/usr/src/sys/compat/linuxkpi/common/include/linux/bitmap.h:338:10: note: previous implicit declaration is here
return (kmalloc_array(BITS_TO_LONGS(size),
^
In file included from /wrkdirs/usr/ports/graphics/drm-devel-kmod/work/drm-kmod-drm_v5.4.62_4/linuxkpi/gplv2/src/linux_compat.c:10:
In file included from /wrkdirs/usr/ports/graphics/drm-devel-kmod/work/drm-kmod-drm_v5.4.62_4/linuxkpi/gplv2/include/linux/pci.h:10:
In file included from /usr/src/sys/compat/linuxkpi/common/include/linux/pci.h:51:
In file included from /usr/src/sys/compat/linuxkpi/common/include/linux/dmapool.h:36:
In file included from /wrkdirs/usr/ports/graphics/drm-devel-kmod/work/drm-kmod-drm_v5.4.62_4/linuxkpi/gplv2/include/linux/scatterlist.h:32:
In file included from /usr/src/sys/compat/linuxkpi/common/include/linux/scatterlist.h:36:
/usr/src/sys/compat/linuxkpi/common/include/linux/slab.h:167:1: error: static declaration of 'kfree' follows non-static declaration
kfree(const void *ptr)
^
/usr/src/sys/compat/linuxkpi/common/include/linux/bitmap.h:351:2: note: previous implicit declaration is here
kfree(bitmap);
^
In file included from /wrkdirs/usr/ports/graphics/drm-devel-kmod/work/drm-kmod-drm_v5.4.62_4/linuxkpi/gplv2/src/linux_compat.c:10:
/wrkdirs/usr/ports/graphics/drm-devel-kmod/work/drm-kmod-drm_v5.4.62_4/linuxkpi/gplv2/include/linux/pci.h:51:1: error: redefinition of 'pci_bus_read_config'
pci_bus_read_config(struct pci_bus *bus, unsigned int devfn,
^
/usr/src/sys/compat/linuxkpi/common/include/linux/pci.h:1101:1: note: previous definition is here
pci_bus_read_config(struct pci_bus *bus, unsigned int devfn,
^
fatal error: too many errors emitted, stopping now [-ferror-limit=]
20 errors generated.
*** [linux_compat.o] Error code 1
make[2]: stopped in /wrkdirs/usr/ports/graphics/drm-devel-kmod/work/drm-kmod-drm_v5.4.62_4/linuxkpi
--- linux_device.o ---
In file included from /wrkdirs/usr/ports/graphics/drm-devel-kmod/work/drm-kmod-drm_v5.4.62_4/linuxkpi/gplv2/src/linux_device.c:2:
/wrkdirs/usr/ports/graphics/drm-devel-kmod/work/drm-kmod-drm_v5.4.62_4/linuxkpi/gplv2/include/linux/pci.h:51:1: error: redefinition of 'pci_bus_read_config'
pci_bus_read_config(struct pci_bus *bus, unsigned int devfn,
^
/usr/src/sys/compat/linuxkpi/common/include/linux/pci.h:1101:1: note: previous definition is here
pci_bus_read_config(struct pci_bus *bus, unsigned int devfn,
^
In file included from /wrkdirs/usr/ports/graphics/drm-devel-kmod/work/drm-kmod-drm_v5.4.62_4/linuxkpi/gplv2/src/linux_device.c:2:
/wrkdirs/usr/ports/graphics/drm-devel-kmod/work/drm-kmod-drm_v5.4.62_4/linuxkpi/gplv2/include/linux/pci.h:67:1: error: redefinition of 'pci_bus_read_config_word'
pci_bus_read_config_word(struct pci_bus *bus, unsigned int devfn, int where, u16 *val)
^
/usr/src/sys/compat/linuxkpi/common/include/linux/pci.h:1110:1: note: previous definition is here
pci_bus_read_config_word(struct pci_bus *bus, unsigned int devfn, int pos, u16 *val)
^
In file included from /wrkdirs/usr/ports/graphics/drm-devel-kmod/work/drm-kmod-drm_v5.4.62_4/linuxkpi/gplv2/src/linux_device.c:2:
/wrkdirs/usr/ports/graphics/drm-devel-kmod/work/drm-kmod-drm_v5.4.62_4/linuxkpi/gplv2/include/linux/pci.h:73:1: error: redefinition of 'pci_bus_read_config_byte'
pci_bus_read_config_byte(struct pci_bus *bus, unsigned int devfn, int where, u8 *val)
^
/usr/src/sys/compat/linuxkpi/common/include/linux/pci.h:1121:1: note: previous definition is here
pci_bus_read_config_byte(struct pci_bus *bus, unsigned int devfn, int pos, u8 *val)
^
In file included from /wrkdirs/usr/ports/graphics/drm-devel-kmod/work/drm-kmod-drm_v5.4.62_4/linuxkpi/gplv2/src/linux_device.c:2:
/wrkdirs/usr/ports/graphics/drm-devel-kmod/work/drm-kmod-drm_v5.4.62_4/linuxkpi/gplv2/include/linux/pci.h:79:1: error: redefinition of 'pci_bus_write_config'
pci_bus_write_config(struct pci_bus *bus, unsigned int devfn, int where,
^
/usr/src/sys/compat/linuxkpi/common/include/linux/pci.h:1132:1: note: previous definition is here
pci_bus_write_config(struct pci_bus *bus, unsigned int devfn, int pos,
^
In file included from /wrkdirs/usr/ports/graphics/drm-devel-kmod/work/drm-kmod-drm_v5.4.62_4/linuxkpi/gplv2/src/linux_device.c:2:
/wrkdirs/usr/ports/graphics/drm-devel-kmod/work/drm-kmod-drm_v5.4.62_4/linuxkpi/gplv2/include/linux/pci.h:95:1: error: redefinition of 'pci_bus_write_config_byte'
pci_bus_write_config_byte(struct pci_bus *bus, unsigned int devfn, int where,
^
/usr/src/sys/compat/linuxkpi/common/include/linux/pci.h:1141:1: note: previous definition is here
pci_bus_write_config_byte(struct pci_bus *bus, unsigned int devfn, int pos,
^
In file included from /wrkdirs/usr/ports/graphics/drm-devel-kmod/work/drm-kmod-drm_v5.4.62_4/linuxkpi/gplv2/src/linux_device.c:2:
/wrkdirs/usr/ports/graphics/drm-devel-kmod/work/drm-kmod-drm_v5.4.62_4/linuxkpi/gplv2/include/linux/pci.h:102:1: error: redefinition of 'pci_domain_nr'
pci_domain_nr(struct pci_bus *bus)
^
/usr/src/sys/compat/linuxkpi/common/include/linux/pci.h:1094:1: note: previous definition is here
pci_domain_nr(struct pci_bus *pbus)
^
In file included from /wrkdirs/usr/ports/graphics/drm-devel-kmod/work/drm-kmod-drm_v5.4.62_4/linuxkpi/gplv2/src/linux_device.c:2:
/wrkdirs/usr/ports/graphics/drm-devel-kmod/work/drm-kmod-drm_v5.4.62_4/linuxkpi/gplv2/include/linux/pci.h:111:1: error: static declaration of 'lkpi_pci_get_domain_bus_and_slot' follows non-static declaration
pci_get_domain_bus_and_slot(int domain, unsigned int bus, unsigned int devfn)
^
/usr/src/sys/compat/linuxkpi/common/include/linux/pci.h:1091:2: note: expanded from macro 'pci_get_domain_bus_and_slot'
lkpi_pci_get_domain_bus_and_slot(domain, bus, devfn)
^
/usr/src/sys/compat/linuxkpi/common/include/linux/pci.h:1088:17: note: previous declaration is here
struct pci_dev *lkpi_pci_get_domain_bus_and_slot(int domain,
^
In file included from /wrkdirs/usr/ports/graphics/drm-devel-kmod/work/drm-kmod-drm_v5.4.62_4/linuxkpi/gplv2/src/linux_device.c:2:
/wrkdirs/usr/ports/graphics/drm-devel-kmod/work/drm-kmod-drm_v5.4.62_4/linuxkpi/gplv2/include/linux/pci.h:120:1: error: redefinition of 'pci_is_root_bus'
pci_is_root_bus(struct pci_bus *pbus)
^
/usr/src/sys/compat/linuxkpi/common/include/linux/pci.h:1082:1: note: previous definition is here
pci_is_root_bus(struct pci_bus *pbus)
^
In file included from /wrkdirs/usr/ports/graphics/drm-devel-kmod/work/drm-kmod-drm_v5.4.62_4/linuxkpi/gplv2/src/linux_device.c:2:
/wrkdirs/usr/ports/graphics/drm-devel-kmod/work/drm-kmod-drm_v5.4.62_4/linuxkpi/gplv2/include/linux/pci.h:153:17: error: incompatible pointer types passing 'device_t' (aka 'struct device *') to parameter of type 'struct pci_dev *' [-Werror,-Wincompatible-pointer-types]
pci_save_state(pdev->dev.bsddev);
^~~~~~~~~~~~~~~~
/usr/src/sys/compat/linuxkpi/common/include/linux/pci.h:722:49: note: expanded from macro 'pci_save_state'
#define pci_save_state(dev) lkpi_pci_save_state(dev)
^~~
/usr/src/sys/compat/linuxkpi/common/include/linux/pci.h:709:37: note: passing argument to parameter 'pdev' here
lkpi_pci_save_state(struct pci_dev *pdev)
^
In file included from /wrkdirs/usr/ports/graphics/drm-devel-kmod/work/drm-kmod-drm_v5.4.62_4/linuxkpi/gplv2/src/linux_device.c:2:
/wrkdirs/usr/ports/graphics/drm-devel-kmod/work/drm-kmod-drm_v5.4.62_4/linuxkpi/gplv2/include/linux/pci.h:160:20: error: incompatible pointer types passing 'device_t' (aka 'struct device *') to parameter of type 'struct pci_dev *' [-Werror,-Wincompatible-pointer-types]
pci_restore_state(pdev->dev.bsddev);
^~~~~~~~~~~~~~~~
/usr/src/sys/compat/linuxkpi/common/include/linux/pci.h:723:55: note: expanded from macro 'pci_restore_state'
#define pci_restore_state(dev) lkpi_pci_restore_state(dev)
^~~
/usr/src/sys/compat/linuxkpi/common/include/linux/pci.h:716:40: note: passing argument to parameter 'pdev' here
lkpi_pci_restore_state(struct pci_dev *pdev)
^
In file included from /wrkdirs/usr/ports/graphics/drm-devel-kmod/work/drm-kmod-drm_v5.4.62_4/linuxkpi/gplv2/src/linux_device.c:2:
/wrkdirs/usr/ports/graphics/drm-devel-kmod/work/drm-kmod-drm_v5.4.62_4/linuxkpi/gplv2/include/linux/pci.h:189:9: error: 'pci_get_class' macro redefined [-Werror,-Wmacro-redefined]
#define pci_get_class(class, dev) linux_pci_get_class(class, dev)
^
/usr/src/sys/compat/linuxkpi/common/include/linux/pci.h:1155:9: note: previous definition is here
#define pci_get_class(class, from) lkpi_pci_get_class(class, from)
^
In file included from /wrkdirs/usr/ports/graphics/drm-devel-kmod/work/drm-kmod-drm_v5.4.62_4/linuxkpi/gplv2/src/linux_device.c:2:
/wrkdirs/usr/ports/graphics/drm-devel-kmod/work/drm-kmod-drm_v5.4.62_4/linuxkpi/gplv2/include/linux/pci.h:190:9: error: 'pci_save_state' macro redefined [-Werror,-Wmacro-redefined]
#define pci_save_state(dev) linux_pci_save_state(dev)
^
/usr/src/sys/compat/linuxkpi/common/include/linux/pci.h:722:9: note: previous definition is here
#define pci_save_state(dev) lkpi_pci_save_state(dev)
^
In file included from /wrkdirs/usr/ports/graphics/drm-devel-kmod/work/drm-kmod-drm_v5.4.62_4/linuxkpi/gplv2/src/linux_device.c:2:
/wrkdirs/usr/ports/graphics/drm-devel-kmod/work/drm-kmod-drm_v5.4.62_4/linuxkpi/gplv2/include/linux/pci.h:191:9: error: 'pci_restore_state' macro redefined [-Werror,-Wmacro-redefined]
#define pci_restore_state(dev) linux_pci_restore_state(dev)
^
/usr/src/sys/compat/linuxkpi/common/include/linux/pci.h:723:9: note: previous definition is here
#define pci_restore_state(dev) lkpi_pci_restore_state(dev)
^
13 errors generated.
*** [linux_device.o] Error code 1
make[2]: stopped in /wrkdirs/usr/ports/graphics/drm-devel-kmod/work/drm-kmod-drm_v5.4.62_4/linuxkpi
2 errors
make[2]: stopped in /wrkdirs/usr/ports/graphics/drm-devel-kmod/work/drm-kmod-drm_v5.4.62_4/linuxkpi
make[1]: stopped in /wrkdirs/usr/ports/graphics/drm-devel-kmod/work/drm-kmod-drm_v5.4.62_4
===> Compilation failed unexpectedly.
Try to set MAKE_JOBS_UNSAFE=yes and rebuild before reporting the failure to
the maintainer.
*** Error code 1
Stop.
make: stopped in /usr/ports/graphics/drm-devel-kmod
More information about the freebsd-pkg-fallout
mailing list