[package - main-i386-default][math/reduce] Failed for reduce-20190413 in stage

pkg-fallout at FreeBSD.org pkg-fallout at FreeBSD.org
Sun Jan 24 22:28:25 UTC 2021


You are receiving this mail as a port that you maintain
is failing to build on the FreeBSD package build server.
Please investigate the failure and submit a PR to fix
build.

Maintainer:     pfg at FreeBSD.org
Last committer: linimon at FreeBSD.org
Ident:          $FreeBSD: head/math/reduce/Makefile 517026 2019-11-08 03:35:22Z linimon $
Log URL:        http://beefy17.nyi.freebsd.org/data/main-i386-default/p562431_sd6327ae8c/logs/reduce-20190413.log
Build URL:      http://beefy17.nyi.freebsd.org/build.html?mastername=main-i386-default&build=p562431_sd6327ae8c
Log:

=>> Building math/reduce
build started at Sun Jan 24 22:22:45 UTC 2021
port directory: /usr/ports/math/reduce
package name: reduce-20190413
building for: FreeBSD main-i386-default-job-09 14.0-CURRENT FreeBSD 14.0-CURRENT 1400001 i386
maintained by: pfg at FreeBSD.org
Makefile ident:      $FreeBSD: head/math/reduce/Makefile 517026 2019-11-08 03:35:22Z linimon $
Poudriere version: 3.2.8-8-gaf08dbda
Host OSVERSION: 1400000
Jail OSVERSION: 1400001
Job Id: 09




!!! Jail is newer than host. (Jail: 1400001, Host: 1400000) !!!
!!! This is not supported. !!!
!!! Host kernel must be same or newer than jail. !!!
!!! Expect build failures. !!!



---Begin Environment---
SHELL=/bin/csh
UNAME_p=i386
UNAME_m=i386
OSVERSION=1400001
UNAME_v=FreeBSD 14.0-CURRENT 1400001
UNAME_r=14.0-CURRENT
BLOCKSIZE=K
MAIL=/var/mail/root
MM_CHARSET=UTF-8
LANG=C.UTF-8
STATUS=1
HOME=/root
PATH=/sbin:/bin:/usr/sbin:/usr/bin:/usr/local/sbin:/usr/local/bin:/root/bin
LOCALBASE=/usr/local
USER=root
LIBEXECPREFIX=/usr/local/libexec/poudriere
POUDRIERE_VERSION=3.2.8-8-gaf08dbda
MASTERMNT=/usr/local/poudriere/data/.m/main-i386-default/ref
POUDRIERE_BUILD_TYPE=bulk
PACKAGE_BUILDING=yes
SAVED_TERM=
PWD=/usr/local/poudriere/data/.m/main-i386-default/ref/.p/pool
P_PORTS_FEATURES=FLAVORS SELECTED_OPTIONS
MASTERNAME=main-i386-default
SCRIPTPREFIX=/usr/local/share/poudriere
OLDPWD=/usr/local/poudriere/data/.m/main-i386-default/ref/.p
SCRIPTPATH=/usr/local/share/poudriere/bulk.sh
POUDRIEREPATH=/usr/local/bin/poudriere
---End Environment---

---Begin Poudriere Port Flags/Env---
PORT_FLAGS=
PKGENV=
FLAVOR=
DEPENDS_ARGS=
MAKE_ARGS=
---End Poudriere Port Flags/Env---

---Begin OPTIONS List---
===> The following configuration options are available for reduce-20190413:
     DOCS=on: Build and/or install documentation
===> Use 'make config' to modify these settings
---End OPTIONS List---

--MAINTAINER--
pfg at FreeBSD.org
--End MAINTAINER--

--CONFIGURE_ARGS--
--with-csl
--End CONFIGURE_ARGS--

--CONFIGURE_ENV--
MAKE=gmake XDG_DATA_HOME=/wrkdirs/usr/ports/math/reduce/work  XDG_CONFIG_HOME=/wrkdirs/usr/ports/math/reduce/work  HOME=/wrkdirs/usr/ports/math/reduce/work TMPDIR="/tmp" PATH=/wrkdirs/usr/ports/math/reduce/work/.bin:/sbin:/bin:/usr/sbin:/usr/bin:/usr/local/sbin:/usr/local/bin:/root/bin SHELL=/bin/sh CONFIG_SHELL=/bin/sh
--End CONFIGURE_ENV--

--MAKE_ENV--
XDG_DATA_HOME=/wrkdirs/usr/ports/math/reduce/work  XDG_CONFIG_HOME=/wrkdirs/usr/ports/math/reduce/work  HOME=/wrkdirs/usr/ports/math/reduce/work TMPDIR="/tmp" PATH=/wrkdirs/usr/ports/math/reduce/work/.bin:/sbin:/bin:/usr/sbin:/usr/bin:/usr/local/sbin:/usr/local/bin:/root/bin NO_PIE=yes MK_DEBUG_FILES=no MK_KERNEL_SYMBOLS=no SHELL=/bin/sh NO_LINT=YES PREFIX=/usr/local  LOCALBASE=/usr/local  CC="cc" CFLAGS="-O2 -pipe  -fstack-protector-strong -fno-strict-aliasing "  CPP="cpp" CPPFLAGS="-I/usr/include `freetype-config --cflags`"  LDFLAGS=" `freetype-config --libs` -fstack-protector-strong " LIBS=""  CXX="c++" CXXFLAGS="-O2 -pipe -fstack-protector-strong -fno-strict-aliasing  "  MANPREFIX="/usr/local" BSD_INSTALL_PROGRAM="install  -s -m 555"  BSD_INSTALL_LIB="install  -s -m 0644"  BSD_INSTALL_SCRIPT="install  -m 555"  BSD_INSTALL_DATA="install  -m 0644"  BSD_INSTALL_MAN="install  -m 444"
--End MAKE_ENV--

--PLIST_SUB--
PORTDOCS="" OSREL=14.0 PREFIX=%D LOCALBASE=/usr/local  RESETPREFIX=/usr/local LIB32DIR=lib DOCSDIR="share/doc/reduce"  EXAMPLESDIR="share/examples/reduce"  DATADIR="share/reduce"  WWWDIR="www/reduce"  ETCDIR="etc/reduce"
--End PLIST_SUB--

--SUB_LIST--
PREFIX=/usr/local LOCALBASE=/usr/local  DATADIR=/usr/local/share/reduce DOCSDIR=/usr/local/share/doc/reduce EXAMPLESDIR=/usr/local/share/examples/reduce  WWWDIR=/usr/local/www/reduce ETCDIR=/usr/local/etc/reduce
--End SUB_LIST--

---Begin make.conf---
USE_PACKAGE_DEPENDS=yes
BATCH=yes
WRKDIRPREFIX=/wrkdirs
PORTSDIR=/usr/ports
PACKAGES=/packages
DISTDIR=/distfiles
PACKAGE_BUILDING=yes
PACKAGE_BUILDING_FLAVORS=yes
MACHINE=i386
MACHINE_ARCH=i386
ARCH=${MACHINE_ARCH}
#### /usr/local/etc/poudriere.d/make.conf ####
# XXX: We really need this but cannot use it while 'make checksum' does not
# try the next mirror on checksum failure.  It currently retries the same
# failed mirror and then fails rather then trying another.  It *does*
# try the next if the size is mismatched though.
#MASTER_SITE_FREEBSD=yes
# Build ALLOW_MAKE_JOBS_PACKAGES with 2 jobs
MAKE_JOBS_NUMBER=2
#### /usr/ports/Mk/Scripts/ports_env.sh ####
_CCVERSION_921dbbb2=FreeBSD clang version 11.0.1 (git at github.com:llvm/llvm-project.git llvmorg-11.0.1-0-g43ff75f2c3fe) Target: i386-unknown-freebsd14.0 Thread model: posix InstalledDir: /usr/bin
_ALTCCVERSION_921dbbb2=none
_CXXINTERNAL_acaad9ca=FreeBSD clang version 11.0.1 (git at github.com:llvm/llvm-project.git llvmorg-11.0.1-0-g43ff75f2c3fe) Target: i386-unknown-freebsd14.0 Thread model: posix InstalledDir: /usr/bin "/usr/bin/ld" "--eh-frame-hdr" "-dynamic-linker" "/libexec/ld-elf.so.1" "--hash-style=both" "--enable-new-dtags" "-m" "elf_i386_fbsd" "-o" "a.out" "/usr/lib/crt1.o" "/usr/lib/crti.o" "/usr/lib/crtbegin.o" "-L/usr/lib" "/dev/null" "-lc++" "-lm" "-lgcc" "--as-needed" "-lgcc_s" "--no-as-needed" "-lc" "-lgcc" "--as-needed" "-lgcc_s" "--no-as-needed" "/usr/lib/crtend.o" "/usr/lib/crtn.o"
CC_OUTPUT_921dbbb2_58173849=yes
CC_OUTPUT_921dbbb2_9bdba57c=yes
CC_OUTPUT_921dbbb2_6a4fe7f5=yes
CC_OUTPUT_921dbbb2_6bcac02b=yes
CC_OUTPUT_921dbbb2_67d20829=yes
CC_OUTPUT_921dbbb2_bfa62e83=yes
CC_OUTPUT_921dbbb2_f0b4d593=yes
CC_OUTPUT_921dbbb2_308abb44=yes
CC_OUTPUT_921dbbb2_f00456e5=yes
CC_OUTPUT_921dbbb2_65ad290d=yes
CC_OUTPUT_921dbbb2_f2776b26=yes
CC_OUTPUT_921dbbb2_b2657cc3=yes
CC_OUTPUT_921dbbb2_380987f7=yes
CC_OUTPUT_921dbbb2_160933ec=yes
CC_OUTPUT_921dbbb2_fb62803b=yes
_OBJC_CCVERSION_921dbbb2=FreeBSD clang version 11.0.1 (git at github.com:llvm/llvm-project.git llvmorg-11.0.1-0-g43ff75f2c3fe) Target: i386-unknown-freebsd14.0 Thread model: posix InstalledDir: /usr/bin
_OBJC_ALTCCVERSION_921dbbb2=none
ARCH=i386
OPSYS=FreeBSD
_OSRELEASE=14.0-CURRENT
OSREL=14.0
OSVERSION=1400001
PYTHONBASE=/usr/local
CONFIGURE_MAX_CMD_LEN=524288
HAVE_PORTS_ENV=1
#### Misc Poudriere ####
GID=0
UID=0
---End make.conf---
--Resource limits--
cpu time               (seconds, -t)  unlimited
file size           (512-blocks, -f)  unlimited
data seg size           (kbytes, -d)  524288
stack size              (kbytes, -s)  65536
core file size      (512-blocks, -c)  unlimited
max memory size         (kbytes, -m)  unlimited
locked memory           (kbytes, -l)  unlimited
max user processes              (-u)  89999
open files                      (-n)  1024
virtual mem size        (kbytes, -v)  unlimited
swap limit              (kbytes, -w)  unlimited
socket buffer size       (bytes, -b)  unlimited
pseudo-terminals                (-p)  unlimited
kqueues                         (-k)  unlimited
umtx shared locks               (-o)  unlimited
--End resource limits--
=======================<phase: check-sanity   >============================
===>  License BSD2CLAUSE accepted by the user
===========================================================================
=======================<phase: pkg-depends    >============================
===>   reduce-20190413 depends on file: /usr/local/sbin/pkg - not found
===>   Installing existing package /packages/All/pkg-1.16.2.txz
[main-i386-default-job-09] Installing pkg-1.16.2...
[main-i386-default-job-09] Extracting pkg-1.16.2: .......... done
===>   reduce-20190413 depends on file: /usr/local/sbin/pkg - found
===>   Returning to build of reduce-20190413
===========================================================================
=======================<phase: fetch-depends  >============================
===========================================================================
=======================<phase: fetch          >============================
===>  License BSD2CLAUSE accepted by the user
===> Fetching all distfiles required by reduce-20190413 for building
===========================================================================
=======================<phase: checksum       >============================
===>  License BSD2CLAUSE accepted by the user
===> Fetching all distfiles required by reduce-20190413 for building
=> SHA256 Checksum OK for Reduce-svn4961-src.tar.gz.
===========================================================================
=======================<phase: extract-depends>============================
===========================================================================
=======================<phase: extract        >============================
===>  License BSD2CLAUSE accepted by the user
===> Fetching all distfiles required by reduce-20190413 for building
===>  Extracting for reduce-20190413
=> SHA256 Checksum OK for Reduce-svn4961-src.tar.gz.
===========================================================================
=======================<phase: patch-depends  >============================
===========================================================================
=======================<phase: patch          >============================
===>  Patching for reduce-20190413
===>  Applying FreeBSD patches for reduce-20190413 from /usr/ports/math/reduce/files
===========================================================================
=======================<phase: build-depends  >============================
===>   reduce-20190413 depends on executable: gnuplot - not found
<snip>
  CXX      csl-arith10.o
/wrkdirs/usr/ports/math/reduce/work/Reduce-svn4961-src/csl/cslbase/arith10.cpp:152:16: warning: function 'CSLcpowi' is not needed and will not be emitted [-Wunneeded-internal-declaration]
static Complex CSLcpowi(Complex z, int n)
               ^
1 warning generated.
  CXX      csl-arith11.o
  CXX      csl-arith12.o
  CXX      csl-arith13.o
  CXX      csl-arith14.o
/wrkdirs/usr/ports/math/reduce/work/Reduce-svn4961-src/csl/cslbase/arith14.cpp:185:13: warning: unused function 'f128X_print' [-Wunused-function]
static void f128X_print(const float128_t *v)
            ^
1 warning generated.
  CXX      csl-isprime.o
/wrkdirs/usr/ports/math/reduce/work/Reduce-svn4961-src/csl/cslbase/isprime.cpp:201:23: warning: unused variable 'hash32_multiplier1' [-Wunused-const-variable]
                      hash32_multiplier1 = UINT64_C(0x9b814cb804ce0bfe);
                      ^
1 warning generated.
  CXX      csl-allocate.o
/wrkdirs/usr/ports/math/reduce/work/Reduce-svn4961-src/csl/cslbase/allocate.cpp:413:20: warning: unused function 'is_header_address' [-Wunused-function]
static inline bool is_header_address(Header *p, page_header *page)
                   ^
/wrkdirs/usr/ports/math/reduce/work/Reduce-svn4961-src/csl/cslbase/allocate.cpp:439:20: warning: unused function 'set_header_bit' [-Wunused-function]
static inline void set_header_bit(LispObject p, page_header *page)
                   ^
/wrkdirs/usr/ports/math/reduce/work/Reduce-svn4961-src/csl/cslbase/allocate.cpp:446:20: warning: unused function 'clear_header_bit' [-Wunused-function]
static inline void clear_header_bit(LispObject p, page_header *page)
                   ^
/wrkdirs/usr/ports/math/reduce/work/Reduce-svn4961-src/csl/cslbase/allocate.cpp:464:20: warning: unused function 'clear_header_bits' [-Wunused-function]
static inline void clear_header_bits(LispObject p, size_t n, page_header *page)
                   ^
/wrkdirs/usr/ports/math/reduce/work/Reduce-svn4961-src/csl/cslbase/allocate.cpp:496:20: warning: unused function 'is_pinned' [-Wunused-function]
static inline bool is_pinned(LispObject p, page_header *page)
                   ^
/wrkdirs/usr/ports/math/reduce/work/Reduce-svn4961-src/csl/cslbase/allocate.cpp:509:20: warning: unused function 'set_pinned' [-Wunused-function]
static inline void set_pinned(LispObject p, page_header *page)
                   ^
/wrkdirs/usr/ports/math/reduce/work/Reduce-svn4961-src/csl/cslbase/allocate.cpp:517:20: warning: unused function 'clear_pinned' [-Wunused-function]
static inline void clear_pinned(LispObject p, page_header *page)
                   ^
/wrkdirs/usr/ports/math/reduce/work/Reduce-svn4961-src/csl/cslbase/allocate.cpp:750:20: warning: unused function 'non_atomic_set_bit' [-Wunused-function]
static inline void non_atomic_set_bit(uint64_t *base, size_t offset)
                   ^
8 warnings generated.
  CXX      csl-bytes1.o
  CXX      csl-char.o
  CXX      csl-cslmpi.o
  CXX      csl-eval1.o
  CXX      csl-eval2.o
  CXX      csl-eval3.o
  CXX      csl-eval4.o
  CXX      csl-fns1.o
  CXX      csl-fns2.o
  CXX      csl-fns3.o
/wrkdirs/usr/ports/math/reduce/work/Reduce-svn4961-src/csl/cslbase/fns3.cpp:817:19: warning: unused function 'Lputvec' [-Wunused-function]
static LispObject Lputvec(LispObject, LispObject v, LispObject n, LispObject x)
                  ^
/wrkdirs/usr/ports/math/reduce/work/Reduce-svn4961-src/csl/cslbase/fns3.cpp:1280:19: warning: unused function 'Lsetelt' [-Wunused-function]
static LispObject Lsetelt(LispObject env, LispObject v, LispObject n, LispObject x)
                  ^
/wrkdirs/usr/ports/math/reduce/work/Reduce-svn4961-src/csl/cslbase/fns3.cpp:1404:19: warning: unused function 'Lchar' [-Wunused-function]
static LispObject Lchar(LispObject env, LispObject v, LispObject n)
                  ^
/wrkdirs/usr/ports/math/reduce/work/Reduce-svn4961-src/csl/cslbase/fns3.cpp:1430:19: warning: unused function 'Lcharset' [-Wunused-function]
static LispObject Lcharset(LispObject env, LispObject v, LispObject n, LispObject c)
                  ^
/wrkdirs/usr/ports/math/reduce/work/Reduce-svn4961-src/csl/cslbase/fns3.cpp:1462:19: warning: unused function 'Lmake_string_3' [-Wunused-function]
static LispObject Lmake_string_3(LispObject env, LispObject n, LispObject key, LispObject init)
                  ^
/wrkdirs/usr/ports/math/reduce/work/Reduce-svn4961-src/csl/cslbase/fns3.cpp:1490:19: warning: unused function 'Lmake_string_1' [-Wunused-function]
static LispObject Lmake_string_1(LispObject env, LispObject n)
                  ^
/wrkdirs/usr/ports/math/reduce/work/Reduce-svn4961-src/csl/cslbase/fns3.cpp:1521:19: warning: unused function 'Lstring' [-Wunused-function]
static LispObject Lstring(LispObject env, LispObject a)
                  ^
/wrkdirs/usr/ports/math/reduce/work/Reduce-svn4961-src/csl/cslbase/fns3.cpp:1554:19: warning: unused function 'Lcopy_vector' [-Wunused-function]
static LispObject Lcopy_vector(LispObject env, LispObject a)
                  ^
/wrkdirs/usr/ports/math/reduce/work/Reduce-svn4961-src/csl/cslbase/fns3.cpp:1620:19: warning: unused function 'Lshrink_vector' [-Wunused-function]
static LispObject Lshrink_vector(LispObject env,
                  ^
9 warnings generated.
  CXX      csl-inthash.o
  CXX      csl-print.o
  CXX      csl-cslread.o
  CXX      reduce-cslread.o
/usr/bin/clang++ /wrkdirs/usr/ports/math/reduce/work/Reduce-svn4961-src/csl/cslbase/objtype.cpp -o objtype
strip objtype
/usr/bin/clang++ /wrkdirs/usr/ports/math/reduce/work/Reduce-svn4961-src/csl/cslbase/makeheaders.cpp -o makeheaders
strip objtype
./objtype reduce-cslread.o \
	machineid-1.cpp cc -DHAVE_CONFIG_H -I. -I/wrkdirs/usr/ports/math/reduce/work/Reduce-svn4961-src/csl/cslbase    -DBINDIR=/usr/local/bin -DPKGDATADIR=/usr/local/share/reduce -Dfontsdir=reduce.fonts -I../include  -I../include -I ../include/fox-1.6 -I../include -I/usr/include -I/usr/local/include/freetype2 -I/usr/local/include -msse2 -mfpmath=sse -I/usr/local/include -I/usr/local/include/freetype2 -I/usr/local/include -I/usr/local/include/freetype2 -I/usr/local/include -D_THREAD_SAFE -pthread  -O2 -pipe  -fstack-protector-strong -fno-strict-aliasing  -shared -fPIC  -O3
./makeheaders config.h \
	/wrkdirs/usr/ports/math/reduce/work/Reduce-svn4961-src/csl/cslbase/machine.h \
	/wrkdirs/usr/ports/math/reduce/work/Reduce-svn4961-src/csl/cslbase/int128_t.h \
	/wrkdirs/usr/ports/math/reduce/work/Reduce-svn4961-src/csl/cslbase/tags.h \
	/wrkdirs/usr/ports/math/reduce/work/Reduce-svn4961-src/csl/cslbase/cslerror.h \
	/wrkdirs/usr/ports/math/reduce/work/Reduce-svn4961-src/csl/cslbase/externs.h \
	/wrkdirs/usr/ports/math/reduce/work/Reduce-svn4961-src/csl/cslbase/arith.h \
	/wrkdirs/usr/ports/math/reduce/work/Reduce-svn4961-src/csl/cslbase/entries.h \
	/wrkdirs/usr/ports/math/reduce/work/Reduce-svn4961-src/csl/cslbase/lispthrow.h \
	> machineid-2.cpp
cat machineid-1.cpp machineid-2.cpp > machineid.cpp
  CXX      csl-restart.o
  CXX      csl-lisphash.o
/wrkdirs/usr/ports/math/reduce/work/Reduce-svn4961-src/csl/cslbase/lisphash.cpp:756:22: warning: explicitly assigning value of variable of type 'LispObject' (aka 'int') to itself [-Wself-assign]
                dims = dims;
                ~~~~ ^ ~~~~
/wrkdirs/usr/ports/math/reduce/work/Reduce-svn4961-src/csl/cslbase/lisphash.cpp:757:21: warning: explicitly assigning value of variable of type 'LispObject' (aka 'int') to itself [-Wself-assign]
                vec = vec;
                ~~~ ^ ~~~
/wrkdirs/usr/ports/math/reduce/work/Reduce-svn4961-src/csl/cslbase/lisphash.cpp:758:26: warning: explicitly assigning value of variable of type 'LispObject' (aka 'int') to itself [-Wself-assign]
                displace = displace;
                ~~~~~~~~ ^ ~~~~~~~~
/wrkdirs/usr/ports/math/reduce/work/Reduce-svn4961-src/csl/cslbase/lisphash.cpp:759:28: warning: explicitly assigning value of variable of type 'LispObject' (aka 'int') to itself [-Wself-assign]
                adjustable = adjustable;
                ~~~~~~~~~~ ^ ~~~~~~~~~~
/wrkdirs/usr/ports/math/reduce/work/Reduce-svn4961-src/csl/cslbase/lisphash.cpp:760:22: warning: explicitly assigning value of variable of type 'LispObject' (aka 'int') to itself [-Wself-assign]
                fill = fill;
                ~~~~ ^ ~~~~
/wrkdirs/usr/ports/math/reduce/work/Reduce-svn4961-src/csl/cslbase/lisphash.cpp:611:13: warning: unused function 'float_if_exact' [-Wunused-function]
static bool float_if_exact(LispObject x)
            ^
6 warnings generated.
  CXX      csl-serialize.o
  CXX      csl-sysfwin.o
  CXX      csl-csl.o
  CXX      csl-fasl.o
  CXX      csl-cslgc.o
/wrkdirs/usr/ports/math/reduce/work/Reduce-svn4961-src/csl/cslbase/cslgc.cpp:669:22: warning: unused variable 't' [-Wunused-variable]
        {   long int t = (long int)(100.0 * consolidated_time[0]);
                     ^
/wrkdirs/usr/ports/math/reduce/work/Reduce-svn4961-src/csl/cslbase/cslgc.cpp:670:22: warning: unused variable 'gct' [-Wunused-variable]
            long int gct = (long int)(100.0 * gc_time);
                     ^
2 warnings generated.
  CXX      csl-preserve.o
  CXX      csl-stubs.o
rm -rf reduce.fonts
mkdir reduce.fonts
cp /wrkdirs/usr/ports/math/reduce/work/Reduce-svn4961-src/csl/cslbase/fonts/README reduce.fonts
cp /wrkdirs/usr/ports/math/reduce/work/Reduce-svn4961-src/csl/cslbase/fonts/README.cmps-fonts reduce.fonts
cp /wrkdirs/usr/ports/math/reduce/work/Reduce-svn4961-src/csl/cslbase/fonts/README.BaKoMa reduce.fonts
cp /wrkdirs/usr/ports/math/reduce/work/Reduce-svn4961-src/csl/cslbase/fonts/*.ttf reduce.fonts
cp /wrkdirs/usr/ports/math/reduce/work/Reduce-svn4961-src/csl/cslbase/fonts/*.pfb reduce.fonts
cp /wrkdirs/usr/ports/math/reduce/work/Reduce-svn4961-src/csl/cslbase/fonts/*.pfa reduce.fonts
cp /wrkdirs/usr/ports/math/reduce/work/Reduce-svn4961-src/csl/cslbase/fonts/fonts.dir reduce.fonts
cp /wrkdirs/usr/ports/math/reduce/work/Reduce-svn4961-src/csl/cslbase/fonts/fonts.scale reduce.fonts
mkdir -p reduce.fonts/pfmfiles
cp -r /wrkdirs/usr/ports/math/reduce/work/Reduce-svn4961-src/csl/cslbase/fonts/pfmfiles/*.pfm reduce.fonts/pfmfiles
mkdir -p reduce.fonts/src
cp -r /wrkdirs/usr/ports/math/reduce/work/Reduce-svn4961-src/csl/cslbase/fonts/src/*.gz reduce.fonts/src
chmod +x reduce.fonts/*.ttf
printf "About to build libffi for %s\n" `pwd`
About to build libffi for /wrkdirs/usr/ports/math/reduce/work/Reduce-svn4961-src/cslbuild/i386-unknown-freebsd14.0/csl
Making install in include
gmake[7]: Nothing to be done for 'install-exec-am'.
 /wrkdirs/usr/ports/math/reduce/work/Reduce-svn4961-src/libraries/libffi/../../install-sh -c -d '/wrkdirs/usr/ports/math/reduce/work/Reduce-svn4961-src/cslbuild/i386-unknown-freebsd14.0/include'
 install  -m 0644 ffi.h ffitarget.h '/wrkdirs/usr/ports/math/reduce/work/Reduce-svn4961-src/cslbuild/i386-unknown-freebsd14.0/include'
Making install in testsuite
gmake[7]: Nothing to be done for 'install-exec-am'.
gmake[7]: Nothing to be done for 'install-data-am'.
Making install in man
gmake[7]: Nothing to be done for 'install-exec-am'.
 /wrkdirs/usr/ports/math/reduce/work/Reduce-svn4961-src/libraries/libffi/../../install-sh -c -d '/wrkdirs/usr/ports/math/reduce/work/Reduce-svn4961-src/cslbuild/i386-unknown-freebsd14.0/share/man/man3'
 install  -m 0644 /wrkdirs/usr/ports/math/reduce/work/Reduce-svn4961-src/libraries/libffi/man/ffi.3 /wrkdirs/usr/ports/math/reduce/work/Reduce-svn4961-src/libraries/libffi/man/ffi_call.3 /wrkdirs/usr/ports/math/reduce/work/Reduce-svn4961-src/libraries/libffi/man/ffi_prep_cif.3 /wrkdirs/usr/ports/math/reduce/work/Reduce-svn4961-src/libraries/libffi/man/ffi_prep_cif_var.3 '/wrkdirs/usr/ports/math/reduce/work/Reduce-svn4961-src/cslbuild/i386-unknown-freebsd14.0/share/man/man3'
depbase=`echo src/x86/sysv.lo | sed 's|[^/]*$|.deps/&|;s|\.lo$||'`;\
/bin/sh ./libtool  --tag=CC   --mode=compile cc -DHAVE_CONFIG_H -I. -I/wrkdirs/usr/ports/math/reduce/work/Reduce-svn4961-src/libraries/libffi  -I. -I/wrkdirs/usr/ports/math/reduce/work/Reduce-svn4961-src/libraries/libffi/include -Iinclude -I/wrkdirs/usr/ports/math/reduce/work/Reduce-svn4961-src/libraries/libffi/src -I/usr/include -I/usr/local/include/freetype2 -I. -I/wrkdirs/usr/ports/math/reduce/work/Reduce-svn4961-src/libraries/libffi/include -Iinclude -I/wrkdirs/usr/ports/math/reduce/work/Reduce-svn4961-src/libraries/libffi/src -O2 -pipe  -fstack-protector-strong -fno-strict-aliasing   -MT src/x86/sysv.lo -MD -MP -MF $depbase.Tpo -c -o src/x86/sysv.lo /wrkdirs/usr/ports/math/reduce/work/Reduce-svn4961-src/libraries/libffi/src/x86/sysv.S &&\
mv -f $depbase.Tpo $depbase.Plo
libtool: compile:  cc -DHAVE_CONFIG_H -I. -I/wrkdirs/usr/ports/math/reduce/work/Reduce-svn4961-src/libraries/libffi -I. -I/wrkdirs/usr/ports/math/reduce/work/Reduce-svn4961-src/libraries/libffi/include -Iinclude -I/wrkdirs/usr/ports/math/reduce/work/Reduce-svn4961-src/libraries/libffi/src -I/usr/include -I/usr/local/include/freetype2 -I. -I/wrkdirs/usr/ports/math/reduce/work/Reduce-svn4961-src/libraries/libffi/include -Iinclude -I/wrkdirs/usr/ports/math/reduce/work/Reduce-svn4961-src/libraries/libffi/src -O2 -pipe -fstack-protector-strong -fno-strict-aliasing -MT src/x86/sysv.lo -MD -MP -MF src/x86/.deps/sysv.Tpo -c /wrkdirs/usr/ports/math/reduce/work/Reduce-svn4961-src/libraries/libffi/src/x86/sysv.S  -fPIC -DPIC -o src/x86/.libs/sysv.o
/wrkdirs/usr/ports/math/reduce/work/Reduce-svn4961-src/libraries/libffi/src/x86/sysv.S:832:1: error: changed section flags for .eh_frame, expected: 0x2
.section .eh_frame,"aw", at progbits
^
gmake[6]: *** [Makefile:1268: src/x86/sysv.lo] Error 1
gmake[5]: *** [Makefile:1365: install-recursive] Error 1
gmake[4]: *** [Makefile:5314: ../lib/libffi.a] Error 2
gmake[3]: *** [Makefile:1331: all] Error 2
gmake[2]: *** [Makefile:675: /wrkdirs/usr/ports/math/reduce/work/Reduce-svn4961-src/m4/libtool.m4] Error 2

Reduce has now been remade
gmake[1]: Leaving directory '/wrkdirs/usr/ports/math/reduce/work/Reduce-svn4961-src'
===========================================================================
=======================<phase: run-depends    >============================
===>   reduce-20190413 depends on file: /usr/local/libdata/pkgconfig/x11.pc - found
===>   reduce-20190413 depends on file: /usr/local/libdata/pkgconfig/xcursor.pc - found
===>   reduce-20190413 depends on file: /usr/local/libdata/pkgconfig/xext.pc - found
===>   reduce-20190413 depends on file: /usr/local/libdata/pkgconfig/xft.pc - found
===>   reduce-20190413 depends on file: /usr/local/libdata/pkgconfig/xrandr.pc - found
===>   reduce-20190413 depends on file: /usr/local/libdata/pkgconfig/xrender.pc - found
===========================================================================
=======================<phase: stage          >============================
===>  Staging for reduce-20190413
===>   Generating temporary packing list
/bin/mkdir -p /wrkdirs/usr/ports/math/reduce/work/stage/usr/local/share/reduce
install  -m 0644 /wrkdirs/usr/ports/math/reduce/work/Reduce-svn4961-src/cslbuild/i386-unknown-freebsd14.0/csl/reduce.img /wrkdirs/usr/ports/math/reduce/work/stage/usr/local/share/reduce
install: /wrkdirs/usr/ports/math/reduce/work/Reduce-svn4961-src/cslbuild/i386-unknown-freebsd14.0/csl/reduce.img: No such file or directory
*** Error code 71

Stop.
make: stopped in /usr/ports/math/reduce


More information about the freebsd-pkg-fallout mailing list