[package - head-powerpc64-default][net/pecl-radius] Failed for php80-pecl-radius-1.4.0.b1 in build

pkg-fallout at FreeBSD.org pkg-fallout at FreeBSD.org
Wed Dec 16 09:00:52 UTC 2020


You are receiving this mail as a port that you maintain
is failing to build on the FreeBSD package build server.
Please investigate the failure and submit a PR to fix
build.

Maintainer:     miwi at FreeBSD.org
Last committer: joneum at FreeBSD.org
Ident:          $FreeBSD: head/net/pecl-radius/Makefile 527886 2020-03-06 17:33:54Z joneum $
Log URL:        http://pylon.nyi.freebsd.org/data/head-powerpc64-default/p557772_s368571/logs/php80-pecl-radius-1.4.0.b1.log
Build URL:      http://pylon.nyi.freebsd.org/build.html?mastername=head-powerpc64-default&build=p557772_s368571
Log:

=>> Building net/pecl-radius
build started at Wed Dec 16 08:59:39 UTC 2020
port directory: /usr/ports/net/pecl-radius
package name: php80-pecl-radius-1.4.0.b1
building for: FreeBSD head-powerpc64-default-job-09 13.0-CURRENT FreeBSD 13.0-CURRENT 1300131 powerpc
maintained by: miwi at FreeBSD.org
Makefile ident:      $FreeBSD: head/net/pecl-radius/Makefile 527886 2020-03-06 17:33:54Z joneum $
Poudriere version: 3.2.8-8-gaf08dbda
Host OSVERSION: 1300121
Jail OSVERSION: 1300131
Job Id: 09




!!! Jail is newer than host. (Jail: 1300131, Host: 1300121) !!!
!!! This is not supported. !!!
!!! Host kernel must be same or newer than jail. !!!
!!! Expect build failures. !!!



---Begin Environment---
SHELL=/bin/csh
OSVERSION=1300131
UNAME_v=FreeBSD 13.0-CURRENT 1300131
UNAME_r=13.0-CURRENT
BLOCKSIZE=K
MAIL=/var/mail/root
MM_CHARSET=UTF-8
LANG=C.UTF-8
STATUS=1
HOME=/root
PATH=/sbin:/bin:/usr/sbin:/usr/bin:/usr/local/sbin:/usr/local/bin:/root/bin
LOCALBASE=/usr/local
USER=root
LIBEXECPREFIX=/usr/local/libexec/poudriere
POUDRIERE_VERSION=3.2.8-8-gaf08dbda
MASTERMNT=/usr/local/poudriere/data/.m/head-powerpc64-default/ref
POUDRIERE_BUILD_TYPE=bulk
PACKAGE_BUILDING=yes
SAVED_TERM=
PWD=/usr/local/poudriere/data/.m/head-powerpc64-default/ref/.p/pool
P_PORTS_FEATURES=FLAVORS SELECTED_OPTIONS
MASTERNAME=head-powerpc64-default
SCRIPTPREFIX=/usr/local/share/poudriere
OLDPWD=/usr/local/poudriere/data/.m/head-powerpc64-default/ref/.p
SCRIPTPATH=/usr/local/share/poudriere/bulk.sh
POUDRIEREPATH=/usr/local/bin/poudriere
---End Environment---

---Begin Poudriere Port Flags/Env---
PORT_FLAGS=
PKGENV=
FLAVOR=php80
DEPENDS_ARGS=
MAKE_ARGS= FLAVOR=php80
---End Poudriere Port Flags/Env---

---Begin OPTIONS List---
===> The following configuration options are available for php80-pecl-radius-1.4.0.b1:
     EXAMPLES=on: Build and/or install examples
===> Use 'make config' to modify these settings
---End OPTIONS List---

--MAINTAINER--
miwi at FreeBSD.org
--End MAINTAINER--

--CONFIGURE_ARGS--
--enable-radius --with-php-config=/usr/local/bin/php-config --prefix=/usr/local ${_LATE_CONFIGURE_ARGS}
--End CONFIGURE_ARGS--

--CONFIGURE_ENV--
XDG_DATA_HOME=/wrkdirs/usr/ports/net/pecl-radius/work-php80  XDG_CONFIG_HOME=/wrkdirs/usr/ports/net/pecl-radius/work-php80  HOME=/wrkdirs/usr/ports/net/pecl-radius/work-php80 TMPDIR="/tmp" PATH=/wrkdirs/usr/ports/net/pecl-radius/work-php80/.bin:/sbin:/bin:/usr/sbin:/usr/bin:/usr/local/sbin:/usr/local/bin:/root/bin SHELL=/bin/sh CONFIG_SHELL=/bin/sh CONFIG_SITE=/usr/ports/Templates/config.site lt_cv_sys_max_cmd_len=524288
--End CONFIGURE_ENV--

--MAKE_ENV--
XDG_DATA_HOME=/wrkdirs/usr/ports/net/pecl-radius/work-php80  XDG_CONFIG_HOME=/wrkdirs/usr/ports/net/pecl-radius/work-php80  HOME=/wrkdirs/usr/ports/net/pecl-radius/work-php80 TMPDIR="/tmp" PATH=/wrkdirs/usr/ports/net/pecl-radius/work-php80/.bin:/sbin:/bin:/usr/sbin:/usr/bin:/usr/local/sbin:/usr/local/bin:/root/bin NO_PIE=yes MK_DEBUG_FILES=no MK_KERNEL_SYMBOLS=no SHELL=/bin/sh NO_LINT=YES PREFIX=/usr/local  LOCALBASE=/usr/local  CC="cc" CFLAGS="-O2 -pipe  -fstack-protector-strong -fno-strict-aliasing "  CPP="cpp" CPPFLAGS=""  LDFLAGS=" -fstack-protector-strong " LIBS=""  CXX="c++" CXXFLAGS="-O2 -pipe -fstack-protector-strong -fno-strict-aliasing  "  MANPREFIX="/usr/local" BSD_INSTALL_PROGRAM="install  -s -m 555"  BSD_INSTALL_LIB="install  -s -m 0644"  BSD_INSTALL_SCRIPT="install  -m 555"  BSD_INSTALL_DATA="install  -m 0644"  BSD_INSTALL_MAN="install  -m 444"
--End MAKE_ENV--

--PLIST_SUB--
PORTEXAMPLES="" PHP_EXT_DIR=20200930 OSREL=13.0 PREFIX=%D LOCALBASE=/usr/local  RESETPREFIX=/usr/local LIB32DIR=lib DOCSDIR="share/doc/radius"  EXAMPLESDIR="share/examples/radius"  DATADIR="share/radius"  WWWDIR="www/radius"  ETCDIR="etc/radius"
--End PLIST_SUB--

--SUB_LIST--
PHP_EXT_DIR=20200930 PREFIX=/usr/local LOCALBASE=/usr/local  DATADIR=/usr/local/share/radius DOCSDIR=/usr/local/share/doc/radius EXAMPLESDIR=/usr/local/share/examples/radius  WWWDIR=/usr/local/www/radius ETCDIR=/usr/local/etc/radius
--End SUB_LIST--

---Begin make.conf---
USE_PACKAGE_DEPENDS=yes
BATCH=yes
WRKDIRPREFIX=/wrkdirs
PORTSDIR=/usr/ports
PACKAGES=/packages
DISTDIR=/distfiles
PACKAGE_BUILDING=yes
PACKAGE_BUILDING_FLAVORS=yes
#### /usr/local/etc/poudriere.d/make.conf ####
# XXX: We really need this but cannot use it while 'make checksum' does not
# try the next mirror on checksum failure.  It currently retries the same
# failed mirror and then fails rather then trying another.  It *does*
# try the next if the size is mismatched though.
#MASTER_SITE_FREEBSD=yes
# Build ALLOW_MAKE_JOBS_PACKAGES with 2 jobs
MAKE_JOBS_NUMBER=2
#### /usr/ports/Mk/Scripts/ports_env.sh ####
_CCVERSION_921dbbb2=FreeBSD clang version 11.0.0 (git at github.com:llvm/llvm-project.git llvmorg-11.0.0-0-g176249bd673) Target: powerpc64-unknown-freebsd13.0 Thread model: posix InstalledDir: /usr/bin
_ALTCCVERSION_921dbbb2=none
_CXXINTERNAL_acaad9ca=FreeBSD clang version 11.0.0 (git at github.com:llvm/llvm-project.git llvmorg-11.0.0-0-g176249bd673) Target: powerpc64-unknown-freebsd13.0 Thread model: posix InstalledDir: /usr/bin "/usr/bin/ld" "--eh-frame-hdr" "-dynamic-linker" "/libexec/ld-elf.so.1" "--enable-new-dtags" "-o" "a.out" "/usr/lib/crt1.o" "/usr/lib/crti.o" "/usr/lib/crtbegin.o" "-L/usr/lib" "/dev/null" "-lc++" "-lm" "-lgcc" "--as-needed" "-lgcc_s" "--no-as-needed" "-lc" "-lgcc" "--as-needed" "-lgcc_s" "--no-as-needed" "/usr/lib/crtend.o" "/usr/lib/crtn.o"
CC_OUTPUT_921dbbb2_58173849=yes
CC_OUTPUT_921dbbb2_9bdba57c=yes
CC_OUTPUT_921dbbb2_6a4fe7f5=yes
CC_OUTPUT_921dbbb2_6bcac02b=yes
CC_OUTPUT_921dbbb2_67d20829=yes
CC_OUTPUT_921dbbb2_bfa62e83=yes
CC_OUTPUT_921dbbb2_f0b4d593=yes
CC_OUTPUT_921dbbb2_308abb44=yes
CC_OUTPUT_921dbbb2_f00456e5=yes
CC_OUTPUT_921dbbb2_65ad290d=yes
CC_OUTPUT_921dbbb2_f2776b26=yes
CC_OUTPUT_921dbbb2_b2657cc3=yes
CC_OUTPUT_921dbbb2_380987f7=yes
CC_OUTPUT_921dbbb2_160933ec=yes
CC_OUTPUT_921dbbb2_fb62803b=yes
_OBJC_CCVERSION_921dbbb2=FreeBSD clang version 11.0.0 (git at github.com:llvm/llvm-project.git llvmorg-11.0.0-0-g176249bd673) Target: powerpc64-unknown-freebsd13.0 Thread model: posix InstalledDir: /usr/bin
_OBJC_ALTCCVERSION_921dbbb2=none
ARCH=powerpc64
PPC_ABI=ELFv2
OPSYS=FreeBSD
_OSRELEASE=13.0-CURRENT
OSREL=13.0
OSVERSION=1300131
PYTHONBASE=/usr/local
CONFIGURE_MAX_CMD_LEN=524288
HAVE_PORTS_ENV=1
#### Misc Poudriere ####
GID=0
UID=0
---End make.conf---
--Resource limits--
cpu time               (seconds, -t)  unlimited
file size           (512-blocks, -f)  unlimited
data seg size           (kbytes, -d)  33554432
stack size              (kbytes, -s)  524288
core file size      (512-blocks, -c)  unlimited
max memory size         (kbytes, -m)  unlimited
locked memory           (kbytes, -l)  unlimited
max user processes              (-u)  89999
open files                      (-n)  1024
virtual mem size        (kbytes, -v)  unlimited
swap limit              (kbytes, -w)  unlimited
socket buffer size       (bytes, -b)  unlimited
pseudo-terminals                (-p)  unlimited
kqueues                         (-k)  unlimited
umtx shared locks               (-o)  unlimited
--End resource limits--
=======================<phase: check-sanity   >============================
===>  License BSD3CLAUSE accepted by the user
===========================================================================
=======================<phase: pkg-depends    >============================
===>   php80-pecl-radius-1.4.0.b1 depends on file: /usr/local/sbin/pkg - not found
===>   Installing existing package /packages/All/pkg-1.15.10.txz
[head-powerpc64-default-job-09] Installing pkg-1.15.10...
[head-powerpc64-default-job-09] Extracting pkg-1.15.10: .......... done
===>   php80-pecl-radius-1.4.0.b1 depends on file: /usr/local/sbin/pkg - found
===>   Returning to build of php80-pecl-radius-1.4.0.b1
===========================================================================
=======================<phase: fetch-depends  >============================
===========================================================================
=======================<phase: fetch          >============================
===>  License BSD3CLAUSE accepted by the user
===> Fetching all distfiles required by php80-pecl-radius-1.4.0.b1 for building
===========================================================================
=======================<phase: checksum       >============================
===>  License BSD3CLAUSE accepted by the user
===> Fetching all distfiles required by php80-pecl-radius-1.4.0.b1 for building
=> SHA256 Checksum OK for PECL/radius-1.4.0b1.tgz.
===========================================================================
=======================<phase: extract-depends>============================
===========================================================================
=======================<phase: extract        >============================
===>  License BSD3CLAUSE accepted by the user
===> Fetching all distfiles required by php80-pecl-radius-1.4.0.b1 for building
===>  Extracting for php80-pecl-radius-1.4.0.b1
=> SHA256 Checksum OK for PECL/radius-1.4.0b1.tgz.
===========================================================================
=======================<phase: patch-depends  >============================
===========================================================================
=======================<phase: patch          >============================
===>  Patching for php80-pecl-radius-1.4.0.b1
===========================================================================
=======================<phase: build-depends  >============================
===>   php80-pecl-radius-1.4.0.b1 depends on file: /usr/local/bin/phpize - not found
===>   Installing existing package /packages/All/php80-8.0.0_1.txz
[head-powerpc64-default-job-09] Installing php80-8.0.0_1...
[head-powerpc64-default-job-09] `-- Installing libargon2-20190702...
[head-powerpc64-default-job-09] `-- Extracting libargon2-20190702: .......... done
[head-powerpc64-default-job-09] `-- Installing libxml2-2.9.10_2...
<snip>
static void compat_zend_delete_resource(const zval *zv TSRMLS_DC)
                                                       ^
./pecl-compat/src/zend_resource.h:85:40: note: to match this '('
static void compat_zend_delete_resource(const zval *zv TSRMLS_DC)
                                       ^
./pecl-compat/src/zend_resource.h:94:93: error: expected ')'
static void *compat_zend_fetch_resource(zval *zv, const char *rsrc_type_name, int rsrc_type TSRMLS_DC)
                                                                                            ^
./pecl-compat/src/zend_resource.h:94:40: note: to match this '('
static void *compat_zend_fetch_resource(zval *zv, const char *rsrc_type_name, int rsrc_type TSRMLS_DC)
                                       ^
./pecl-compat/src/zend_resource.h:103:78: error: expected ')'
static void compat_zend_register_resource(zval *zv, void *ptr, int rsrc_type TSRMLS_DC)
                                                                             ^
./pecl-compat/src/zend_resource.h:103:42: note: to match this '('
static void compat_zend_register_resource(zval *zv, void *ptr, int rsrc_type TSRMLS_DC)
                                         ^
/wrkdirs/usr/ports/net/pecl-radius/work-php80/radius-1.4.0b1/radius.c:54:39: error: expected ')'
void _radius_close(zend_resource *res TSRMLS_DC);
                                      ^
/wrkdirs/usr/ports/net/pecl-radius/work-php80/radius-1.4.0b1/radius.c:54:19: note: to match this '('
void _radius_close(zend_resource *res TSRMLS_DC);
                  ^
--- radlib.lo ---
/wrkdirs/usr/ports/net/pecl-radius/work-php80/radius-1.4.0b1/radlib.c:504:55: warning: passing 'int *' to parameter of type 'socklen_t *' (aka 'unsigned int *') converts between pointers to integer types with different sign [-Wpointer-sign]
                    MSGSIZE, MSG_WAITALL, (struct sockaddr *)&from, &fromlen);
                                                                    ^~~~~~~~
/usr/include/sys/socket.h:692:96: note: passing argument to parameter here
ssize_t recvfrom(int, void *, size_t, int, struct sockaddr * __restrict, socklen_t * __restrict);
                                                                                               ^
/wrkdirs/usr/ports/net/pecl-radius/work-php80/radius-1.4.0b1/radlib.c:584:3: warning: implicit declaration of function 'TSRMLS_FETCH' is invalid in C99 [-Wimplicit-function-declaration]
                TSRMLS_FETCH();
                ^
/wrkdirs/usr/ports/net/pecl-radius/work-php80/radius-1.4.0b1/radlib.c:585:16: error: use of undeclared identifier 'TSRMLS_C'
                r = php_rand(TSRMLS_C);
                             ^
--- radius.lo ---
/wrkdirs/usr/ports/net/pecl-radius/work-php80/radius-1.4.0b1/radius.c:168:63: error: expected ')'
                compat_zend_register_resource(return_value, radh, le_radius TSRMLS_CC);
                                                                            ^
--- radlib.lo ---
/wrkdirs/usr/ports/net/pecl-radius/work-php80/radius-1.4.0b1/radlib.c:752:3: warning: implicit declaration of function 'TSRMLS_FETCH' is invalid in C99 [-Wimplicit-function-declaration]
                TSRMLS_FETCH();
                ^
--- radius.lo ---
/wrkdirs/usr/ports/net/pecl-radius/work-php80/radius-1.4.0b1/radius.c:168:32: note: to match this '('
                compat_zend_register_resource(return_value, radh, le_radius TSRMLS_CC);
                                             ^
/wrkdirs/usr/ports/net/pecl-radius/work-php80/radius-1.4.0b1/radius.c:181:63: error: expected ')'
                compat_zend_register_resource(return_value, radh, le_radius TSRMLS_CC);
                                                                            ^
/wrkdirs/usr/ports/net/pecl-radius/work-php80/radius-1.4.0b1/radius.c:181:32: note: to match this '('
                compat_zend_register_resource(return_value, radh, le_radius TSRMLS_CC);
                                             ^
/wrkdirs/usr/ports/net/pecl-radius/work-php80/radius-1.4.0b1/radius.c:194:44: error: expected ')'
        if (zend_parse_parameters(ZEND_NUM_ARGS() TSRMLS_CC, "r", &z_radh) == FAILURE) {
                                                  ^
/wrkdirs/usr/ports/net/pecl-radius/work-php80/radius-1.4.0b1/radius.c:194:27: note: to match this '('
        if (zend_parse_parameters(ZEND_NUM_ARGS() TSRMLS_CC, "r", &z_radh) == FAILURE) {
                                 ^
/wrkdirs/usr/ports/net/pecl-radius/work-php80/radius-1.4.0b1/radius.c:199:2: error: expected ')'
        RADIUS_FETCH_RESOURCE(radh, z_radh);
        ^
/wrkdirs/usr/ports/net/pecl-radius/work-php80/radius-1.4.0b1/radius.c:59:85: note: expanded from macro 'RADIUS_FETCH_RESOURCE'
        radh = (struct rad_handle *)compat_zend_fetch_resource(zv, "rad_handle", le_radius TSRMLS_CC); \
                                                                                           ^
/wrkdirs/usr/ports/net/pecl-radius/work-php80/radius-1.4.0b1/radius.c:199:2: note: to match this '('
/wrkdirs/usr/ports/net/pecl-radius/work-php80/radius-1.4.0b1/radius.c:59:56: note: expanded from macro 'RADIUS_FETCH_RESOURCE'
        radh = (struct rad_handle *)compat_zend_fetch_resource(zv, "rad_handle", le_radius TSRMLS_CC); \
                                                              ^
/wrkdirs/usr/ports/net/pecl-radius/work-php80/radius-1.4.0b1/radius.c:200:37: error: expected ')'
        compat_zend_delete_resource(z_radh TSRMLS_CC);
                                           ^
/wrkdirs/usr/ports/net/pecl-radius/work-php80/radius-1.4.0b1/radius.c:200:29: note: to match this '('
        compat_zend_delete_resource(z_radh TSRMLS_CC);
                                   ^
/wrkdirs/usr/ports/net/pecl-radius/work-php80/radius-1.4.0b1/radius.c:212:44: error: expected ')'
        if (zend_parse_parameters(ZEND_NUM_ARGS() TSRMLS_CC, "r", &z_radh) == FAILURE) {
                                                  ^
/wrkdirs/usr/ports/net/pecl-radius/work-php80/radius-1.4.0b1/radius.c:212:27: note: to match this '('
--- radlib.lo ---
/wrkdirs/usr/ports/net/pecl-radius/work-php80/radius-1.4.0b1/radlib.c:753:71: error: use of undeclared identifier 'TSRMLS_C'
--- radius.lo ---
        if (zend_parse_parameters(ZEND_NUM_ARGS() TSRMLS_CC, "r", &z_radh) == FAILURE) {
                                 ^
/wrkdirs/usr/ports/net/pecl-radius/work-php80/radius-1.4.0b1/radius.c:216:2: error: expected ')'
        RADIUS_FETCH_RESOURCE(radh, z_radh);
        ^
/wrkdirs/usr/ports/net/pecl-radius/work-php80/radius-1.4.0b1/radius.c:59:85: note: expanded from macro 'RADIUS_FETCH_RESOURCE'
--- radlib.lo ---
                php_srand(time(NULL) * getpid() * (unsigned long) (php_combined_lcg(TSRMLS_C) * 10000.0) TSRMLS_CC);
                                                                                    ^
--- radius.lo ---
        radh = (struct rad_handle *)compat_zend_fetch_resource(zv, "rad_handle", le_radius TSRMLS_CC); \
                                                                                           ^
/wrkdirs/usr/ports/net/pecl-radius/work-php80/radius-1.4.0b1/radius.c:216:2: note: to match this '('
/wrkdirs/usr/ports/net/pecl-radius/work-php80/radius-1.4.0b1/radius.c:59:56: note: expanded from macro 'RADIUS_FETCH_RESOURCE'
        radh = (struct rad_handle *)compat_zend_fetch_resource(zv, "rad_handle", le_radius TSRMLS_CC); \
                                                              ^
/wrkdirs/usr/ports/net/pecl-radius/work-php80/radius-1.4.0b1/radius.c:230:44: error: expected ')'
        if (zend_parse_parameters(ZEND_NUM_ARGS() TSRMLS_CC, "rs", &z_radh, &filename, &filename_len) == FAILURE) {
                                                  ^
/wrkdirs/usr/ports/net/pecl-radius/work-php80/radius-1.4.0b1/radius.c:230:27: note: to match this '('
        if (zend_parse_parameters(ZEND_NUM_ARGS() TSRMLS_CC, "rs", &z_radh, &filename, &filename_len) == FAILURE) {
                                 ^
/wrkdirs/usr/ports/net/pecl-radius/work-php80/radius-1.4.0b1/radius.c:234:2: error: expected ')'
        RADIUS_FETCH_RESOURCE(radh, z_radh);
        ^
/wrkdirs/usr/ports/net/pecl-radius/work-php80/radius-1.4.0b1/radius.c:59:85: note: expanded from macro 'RADIUS_FETCH_RESOURCE'
        radh = (struct rad_handle *)compat_zend_fetch_resource(zv, "rad_handle", le_radius TSRMLS_CC); \
                                                                                           ^
/wrkdirs/usr/ports/net/pecl-radius/work-php80/radius-1.4.0b1/radius.c:234:2: note: to match this '('
/wrkdirs/usr/ports/net/pecl-radius/work-php80/radius-1.4.0b1/radius.c:59:56: note: expanded from macro 'RADIUS_FETCH_RESOURCE'
        radh = (struct rad_handle *)compat_zend_fetch_resource(zv, "rad_handle", le_radius TSRMLS_CC); \
                                                              ^
--- radlib.lo ---
/wrkdirs/usr/ports/net/pecl-radius/work-php80/radius-1.4.0b1/radlib.c:756:23: error: use of undeclared identifier 'TSRMLS_C'
                h->ident = php_rand(TSRMLS_C);
                                    ^
--- radius.lo ---
/wrkdirs/usr/ports/net/pecl-radius/work-php80/radius-1.4.0b1/radius.c:253:44: error: expected ')'
        if (zend_parse_parameters(ZEND_NUM_ARGS() TSRMLS_CC, "rslsll", &z_radh,
                                                  ^
/wrkdirs/usr/ports/net/pecl-radius/work-php80/radius-1.4.0b1/radius.c:253:27: note: to match this '('
        if (zend_parse_parameters(ZEND_NUM_ARGS() TSRMLS_CC, "rslsll", &z_radh,
                                 ^
/wrkdirs/usr/ports/net/pecl-radius/work-php80/radius-1.4.0b1/radius.c:261:2: error: expected ')'
        RADIUS_FETCH_RESOURCE(radh, z_radh);
        ^
/wrkdirs/usr/ports/net/pecl-radius/work-php80/radius-1.4.0b1/radius.c:59:85: note: expanded from macro 'RADIUS_FETCH_RESOURCE'
        radh = (struct rad_handle *)compat_zend_fetch_resource(zv, "rad_handle", le_radius TSRMLS_CC); \
                                                                                           ^
/wrkdirs/usr/ports/net/pecl-radius/work-php80/radius-1.4.0b1/radius.c:261:2: note: to match this '('
/wrkdirs/usr/ports/net/pecl-radius/work-php80/radius-1.4.0b1/radius.c:59:56: note: expanded from macro 'RADIUS_FETCH_RESOURCE'
        radh = (struct rad_handle *)compat_zend_fetch_resource(zv, "rad_handle", le_radius TSRMLS_CC); \
                                                              ^
/wrkdirs/usr/ports/net/pecl-radius/work-php80/radius-1.4.0b1/radius.c:278:44: error: expected ')'
        if (zend_parse_parameters(ZEND_NUM_ARGS() TSRMLS_CC, "rl", &z_radh, &code) == FAILURE) {
                                                  ^
/wrkdirs/usr/ports/net/pecl-radius/work-php80/radius-1.4.0b1/radius.c:278:27: note: to match this '('
        if (zend_parse_parameters(ZEND_NUM_ARGS() TSRMLS_CC, "rl", &z_radh, &code) == FAILURE) {
                                 ^
fatal error: too many errors emitted, stopping now [-ferror-limit=]
--- radlib.lo ---
/wrkdirs/usr/ports/net/pecl-radius/work-php80/radius-1.4.0b1/radlib.c:1038:42: warning: format specifies type 'int' but the argument has type 'size_t' (aka 'unsigned long') [-Wformat]
                generr(h, "malloc failure (%d bytes)", va_len);
                                           ~~          ^~~~~~
                                           %zu
/wrkdirs/usr/ports/net/pecl-radius/work-php80/radius-1.4.0b1/radlib.c:1221:55: warning: format specifies type 'int' but the argument has type 'size_t' (aka 'unsigned long') [-Wformat]
                generr(h, "Mangled data seems to be garbage %d %d", *len, mlen-1);        
                                                            ~~      ^~~~
                                                            %zu
/wrkdirs/usr/ports/net/pecl-radius/work-php80/radius-1.4.0b1/radlib.c:1221:61: warning: format specifies type 'int' but the argument has type 'unsigned long' [-Wformat]
                generr(h, "Mangled data seems to be garbage %d %d", *len, mlen-1);        
                                                               ~~         ^~~~~~
                                                               %lu
/wrkdirs/usr/ports/net/pecl-radius/work-php80/radius-1.4.0b1/radlib.c:1226:48: warning: format specifies type 'int' but the argument has type 'size_t' (aka 'unsigned long') [-Wformat]
                generr(h, "Key to long (%d) for me max. %d", *len, MPPE_KEY_LEN);        
                                        ~~                   ^~~~
                                        %zu
/wrkdirs/usr/ports/net/pecl-radius/work-php80/radius-1.4.0b1/radlib.c:1245:2: warning: implicit declaration of function 'TSRMLS_FETCH' is invalid in C99 [-Wimplicit-function-declaration]
        TSRMLS_FETCH();
        ^
--- radius.lo ---
20 errors generated.
--- radlib.lo ---
/wrkdirs/usr/ports/net/pecl-radius/work-php80/radius-1.4.0b1/radlib.c:1292:20: error: use of undeclared identifier 'TSRMLS_C'
        random = php_rand(TSRMLS_C);
                          ^
/wrkdirs/usr/ports/net/pecl-radius/work-php80/radius-1.4.0b1/radlib.c:1306:11: warning: passing 'char [16]' to parameter of type 'unsigned char *' converts between pointers to integer types with different sign [-Wpointer-sign]
        MD5Final(intermediate, &md5);
                 ^~~~~~~~~~~~
/usr/local/include/php/ext/standard/md5.h:47:41: note: passing argument to parameter 'result' here
PHPAPI void PHP_MD5Final(unsigned char *result, PHP_MD5_CTX *ctx);
                                        ^
/wrkdirs/usr/ports/net/pecl-radius/work-php80/radius-1.4.0b1/radlib.c:1324:12: warning: passing 'char [16]' to parameter of type 'unsigned char *' converts between pointers to integer types with different sign [-Wpointer-sign]
                MD5Final(intermediate, &md5);
                         ^~~~~~~~~~~~
/usr/local/include/php/ext/standard/md5.h:47:41: note: passing argument to parameter 'result' here
PHPAPI void PHP_MD5Final(unsigned char *result, PHP_MD5_CTX *ctx);
                                        ^
10 warnings and 4 errors generated.
--- radius.lo ---
*** [radius.lo] Error code 1

make[1]: stopped in /wrkdirs/usr/ports/net/pecl-radius/work-php80/radius-1.4.0b1
--- radlib.lo ---
*** [radlib.lo] Error code 1

make[1]: stopped in /wrkdirs/usr/ports/net/pecl-radius/work-php80/radius-1.4.0b1
2 errors

make[1]: stopped in /wrkdirs/usr/ports/net/pecl-radius/work-php80/radius-1.4.0b1
===> Compilation failed unexpectedly.
Try to set MAKE_JOBS_UNSAFE=yes and rebuild before reporting the failure to
the maintainer.
*** Error code 1

Stop.
make: stopped in /usr/ports/net/pecl-radius


More information about the freebsd-pkg-fallout mailing list