[package - head-armv6-default][net/pecl-yaz] Failed for php80-pecl-yaz-1.2.1 in build

pkg-fallout at FreeBSD.org pkg-fallout at FreeBSD.org
Sat Dec 5 08:47:18 UTC 2020


You are receiving this mail as a port that you maintain
is failing to build on the FreeBSD package build server.
Please investigate the failure and submit a PR to fix
build.

Maintainer:     fw at moov.de
Last committer: tobik at FreeBSD.org
Ident:          $FreeBSD: head/net/pecl-yaz/Makefile 517064 2019-11-08 13:48:34Z tobik $
Log URL:        http://beefy8.nyi.freebsd.org/data/head-armv6-default/p556876_s368287/logs/php80-pecl-yaz-1.2.1.log
Build URL:      http://beefy8.nyi.freebsd.org/build.html?mastername=head-armv6-default&build=p556876_s368287
Log:

=>> Building net/pecl-yaz
build started at Sat Dec  5 08:45:53 UTC 2020
port directory: /usr/ports/net/pecl-yaz
package name: php80-pecl-yaz-1.2.1
building for: FreeBSD head-armv6-default-job-17 13.0-CURRENT FreeBSD 13.0-CURRENT 1300130 arm
maintained by: fw at moov.de
Makefile ident:      $FreeBSD: head/net/pecl-yaz/Makefile 517064 2019-11-08 13:48:34Z tobik $
Poudriere version: 3.2.8-8-gaf08dbda
Host OSVERSION: 1300121
Jail OSVERSION: 1300130
Job Id: 17




!!! Jail is newer than host. (Jail: 1300130, Host: 1300121) !!!
!!! This is not supported. !!!
!!! Host kernel must be same or newer than jail. !!!
!!! Expect build failures. !!!



---Begin Environment---
SHELL=/bin/csh
UNAME_p=armv6
UNAME_m=arm
ABI_FILE=/usr/lib/crt1.o
OSVERSION=1300130
UNAME_v=FreeBSD 13.0-CURRENT 1300130
UNAME_r=13.0-CURRENT
BLOCKSIZE=K
MAIL=/var/mail/root
MM_CHARSET=UTF-8
LANG=C.UTF-8
STATUS=1
HOME=/root
PATH=/sbin:/bin:/usr/sbin:/usr/bin:/usr/local/sbin:/usr/local/bin:/root/bin
LOCALBASE=/usr/local
QEMU_EMULATING=1
USER=root
LIBEXECPREFIX=/usr/local/libexec/poudriere
POUDRIERE_VERSION=3.2.8-8-gaf08dbda
MASTERMNT=/usr/local/poudriere/data/.m/head-armv6-default/ref
POUDRIERE_BUILD_TYPE=bulk
PACKAGE_BUILDING=yes
SAVED_TERM=
PWD=/usr/local/poudriere/data/.m/head-armv6-default/ref/.p/pool
P_PORTS_FEATURES=FLAVORS SELECTED_OPTIONS
MASTERNAME=head-armv6-default
SCRIPTPREFIX=/usr/local/share/poudriere
OLDPWD=/usr/local/poudriere/data/.m/head-armv6-default/ref/.p
SCRIPTPATH=/usr/local/share/poudriere/bulk.sh
POUDRIEREPATH=/usr/local/bin/poudriere
---End Environment---

---Begin Poudriere Port Flags/Env---
PORT_FLAGS=
PKGENV=
FLAVOR=php80
DEPENDS_ARGS=
MAKE_ARGS= FLAVOR=php80
---End Poudriere Port Flags/Env---

---Begin OPTIONS List---
---End OPTIONS List---

--MAINTAINER--
fw at moov.de
--End MAINTAINER--

--CONFIGURE_ARGS--
--with-yaz=/usr/local --with-php-config=/usr/local/bin/php-config --prefix=/usr/local ${_LATE_CONFIGURE_ARGS}
--End CONFIGURE_ARGS--

--CONFIGURE_ENV--
XDG_DATA_HOME=/wrkdirs/usr/ports/net/pecl-yaz/work-php80  XDG_CONFIG_HOME=/wrkdirs/usr/ports/net/pecl-yaz/work-php80  HOME=/wrkdirs/usr/ports/net/pecl-yaz/work-php80 TMPDIR="/tmp" PATH=/wrkdirs/usr/ports/net/pecl-yaz/work-php80/.bin:/sbin:/bin:/usr/sbin:/usr/bin:/usr/local/sbin:/usr/local/bin:/root/bin SHELL=/bin/sh CONFIG_SHELL=/bin/sh LANG=en_US.UTF-8 LC_ALL=en_US.UTF-8 CONFIG_SITE=/usr/ports/Templates/config.site lt_cv_sys_max_cmd_len=524288
--End CONFIGURE_ENV--

--MAKE_ENV--
XDG_DATA_HOME=/wrkdirs/usr/ports/net/pecl-yaz/work-php80  XDG_CONFIG_HOME=/wrkdirs/usr/ports/net/pecl-yaz/work-php80  HOME=/wrkdirs/usr/ports/net/pecl-yaz/work-php80 TMPDIR="/tmp" PATH=/wrkdirs/usr/ports/net/pecl-yaz/work-php80/.bin:/sbin:/bin:/usr/sbin:/usr/bin:/usr/local/sbin:/usr/local/bin:/root/bin NO_PIE=yes MK_DEBUG_FILES=no MK_KERNEL_SYMBOLS=no SHELL=/bin/sh NO_LINT=YES LANG=en_US.UTF-8 LC_ALL=en_US.UTF-8 PREFIX=/usr/local  LOCALBASE=/usr/local  CC="/nxb-bin/usr/bin/cc" CFLAGS="-O2 -pipe  -fstack-protector-strong -fno-strict-aliasing "  CPP="/nxb-bin/usr/bin/cpp" CPPFLAGS=""  LDFLAGS=" -fstack-protector-strong " LIBS=""  CXX="/nxb-bin/usr/bin/c++" CXXFLAGS="-O2 -pipe -fstack-protector-strong -fno-strict-aliasing  "  MANPREFIX="/usr/local" BSD_INSTALL_PROGRAM="install  -s -m 555"  BSD_INSTALL_LIB="install  -s -m 0644"  BSD_INSTALL_SCRIPT="install  -m 555"  BSD_INSTALL_DATA="install  -m 0644"  BSD_INSTALL_MAN="install  -m 444"
--End MAKE_ENV--

--PLIST_SUB--
GTK2_VERSION="2.10.0"  GTK3_VERSION="3.0.0" PHP_EXT_DIR=20200930 OSREL=13.0 PREFIX=%D LOCALBASE=/usr/local  RESETPREFIX=/usr/local LIB32DIR=lib DOCSDIR="share/doc/yaz"  EXAMPLESDIR="share/examples/yaz"  DATADIR="share/yaz"  WWWDIR="www/yaz"  ETCDIR="etc/yaz"
--End PLIST_SUB--

--SUB_LIST--
PHP_EXT_DIR=20200930 PREFIX=/usr/local LOCALBASE=/usr/local  DATADIR=/usr/local/share/yaz DOCSDIR=/usr/local/share/doc/yaz EXAMPLESDIR=/usr/local/share/examples/yaz  WWWDIR=/usr/local/www/yaz ETCDIR=/usr/local/etc/yaz
--End SUB_LIST--

---Begin make.conf---
.sinclude "/etc/make.nxb.conf"
USE_PACKAGE_DEPENDS=yes
BATCH=yes
WRKDIRPREFIX=/wrkdirs
PORTSDIR=/usr/ports
PACKAGES=/packages
DISTDIR=/distfiles
PACKAGE_BUILDING=yes
PACKAGE_BUILDING_FLAVORS=yes
MACHINE=arm
MACHINE_ARCH=armv6
ARCH=${MACHINE_ARCH}
#### /usr/local/etc/poudriere.d/make.conf ####
# XXX: We really need this but cannot use it while 'make checksum' does not
# try the next mirror on checksum failure.  It currently retries the same
# failed mirror and then fails rather then trying another.  It *does*
# try the next if the size is mismatched though.
#MASTER_SITE_FREEBSD=yes
# Build ALLOW_MAKE_JOBS_PACKAGES with 2 jobs
MAKE_JOBS_NUMBER=2
#### /usr/ports/Mk/Scripts/ports_env.sh ####
_CCVERSION_9d218390=FreeBSD clang version 11.0.0 (git at github.com:llvm/llvm-project.git llvmorg-11.0.0-0-g176249bd673) Target: armv6-unknown-freebsd13.0-gnueabihf Thread model: posix InstalledDir: /nxb-bin/usr/bin
_ALTCCVERSION_9d218390=none
_CXXINTERNAL_9c45a5b1=FreeBSD clang version 11.0.0 (git at github.com:llvm/llvm-project.git llvmorg-11.0.0-0-g176249bd673) Target: armv6-unknown-freebsd13.0-gnueabihf Thread model: posix InstalledDir: /nxb-bin/usr/bin "/nxb-bin/usr/bin/ld" "--eh-frame-hdr" "-dynamic-linker" "/libexec/ld-elf.so.1" "--hash-style=both" "--enable-new-dtags" "-o" "a.out" "/usr/lib/crt1.o" "/usr/lib/crti.o" "/usr/lib/crtbegin.o" "-L/usr/lib" "/dev/null" "-lc++" "-lm" "-lgcc" "--as-needed" "-lgcc_s" "--no-as-needed" "-lc" "-lgcc" "--as-needed" "-lgcc_s" "--no-as-needed" "/usr/lib/crtend.o" "/usr/lib/crtn.o"
CC_OUTPUT_9d218390_58173849=yes
CC_OUTPUT_9d218390_9bdba57c=yes
CC_OUTPUT_9d218390_6a4fe7f5=yes
CC_OUTPUT_9d218390_6bcac02b=yes
CC_OUTPUT_9d218390_67d20829=yes
CC_OUTPUT_9d218390_bfa62e83=yes
CC_OUTPUT_9d218390_f0b4d593=yes
CC_OUTPUT_9d218390_308abb44=yes
CC_OUTPUT_9d218390_f00456e5=yes
CC_OUTPUT_9d218390_65ad290d=yes
CC_OUTPUT_9d218390_f2776b26=yes
CC_OUTPUT_9d218390_b2657cc3=yes
CC_OUTPUT_9d218390_380987f7=yes
CC_OUTPUT_9d218390_160933ec=yes
CC_OUTPUT_9d218390_fb62803b=yes
_OBJC_CCVERSION_9d218390=FreeBSD clang version 11.0.0 (git at github.com:llvm/llvm-project.git llvmorg-11.0.0-0-g176249bd673) Target: armv6-unknown-freebsd13.0-gnueabihf Thread model: posix InstalledDir: /nxb-bin/usr/bin
_OBJC_ALTCCVERSION_9d218390=none
ARCH=armv6
OPSYS=FreeBSD
_OSRELEASE=13.0-CURRENT
OSREL=13.0
OSVERSION=1300130
PYTHONBASE=/usr/local
CONFIGURE_MAX_CMD_LEN=524288
HAVE_PORTS_ENV=1
#### Misc Poudriere ####
GID=0
UID=0
DISABLE_MAKE_JOBS=poudriere
---End make.conf---
---Begin make.nxb.conf---
CC=/nxb-bin/usr/bin/cc
CPP=/nxb-bin/usr/bin/cpp
CXX=/nxb-bin/usr/bin/c++
NM=/nxb-bin/usr/bin/nm
LD=/nxb-bin/usr/bin/ld
OBJCOPY=/nxb-bin/usr/bin/objcopy
SIZE=/nxb-bin/usr/bin/size
STRIPBIN=/nxb-bin/usr/bin/strip
SED=/nxb-bin/usr/bin/sed
RANLIB=/nxb-bin/usr/bin/ranlib
YACC=/nxb-bin/usr/bin/yacc
MAKE=/nxb-bin/usr/bin/make
STRINGS=/nxb-bin/usr/bin/strings
AWK=/nxb-bin/usr/bin/awk
FLEX=/nxb-bin/usr/bin/flex
---End make.nxb.conf---
--Resource limits--
cpu time               (seconds, -t)  unlimited
file size           (512-blocks, -f)  unlimited
data seg size           (kbytes, -d)  33554432
stack size              (kbytes, -s)  524288
core file size      (512-blocks, -c)  unlimited
max memory size         (kbytes, -m)  unlimited
locked memory           (kbytes, -l)  unlimited
max user processes              (-u)  89999
open files                      (-n)  1024
virtual mem size        (kbytes, -v)  unlimited
swap limit              (kbytes, -w)  unlimited
socket buffer size       (bytes, -b)  unlimited
pseudo-terminals                (-p)  unlimited
kqueues                         (-k)  unlimited
umtx shared locks               (-o)  unlimited
--End resource limits--
=======================<phase: check-sanity   >============================
===>  License PHP301 accepted by the user
===========================================================================
=======================<phase: pkg-depends    >============================
===>   php80-pecl-yaz-1.2.1 depends on file: /usr/local/sbin/pkg - not found
===>   Installing existing package /packages/All/pkg-1.15.10.txz
[head-armv6-default-job-17] Installing pkg-1.15.10...
[head-armv6-default-job-17] Extracting pkg-1.15.10: .......... done
===>   php80-pecl-yaz-1.2.1 depends on file: /usr/local/sbin/pkg - found
===>   Returning to build of php80-pecl-yaz-1.2.1
===========================================================================
=======================<phase: fetch-depends  >============================
===========================================================================
=======================<phase: fetch          >============================
===>  License PHP301 accepted by the user
===> Fetching all distfiles required by php80-pecl-yaz-1.2.1 for building
===========================================================================
=======================<phase: checksum       >============================
===>  License PHP301 accepted by the user
===> Fetching all distfiles required by php80-pecl-yaz-1.2.1 for building
<snip>
checking command to parse /usr/bin/nm output from /nxb-bin/usr/bin/cc object... ok
checking for objdir... .libs
checking for ar... ar
checking for ranlib... ranlib
checking for strip... strip
checking if /nxb-bin/usr/bin/cc supports -fno-rtti -fno-exceptions... yes
checking for /nxb-bin/usr/bin/cc option to produce PIC... -fPIC
checking if /nxb-bin/usr/bin/cc PIC flag -fPIC works... yes
checking if /nxb-bin/usr/bin/cc static flag -static works... yes
checking if /nxb-bin/usr/bin/cc supports -c -o file.o... yes
checking whether the /nxb-bin/usr/bin/cc linker (/nxb-bin/usr/bin/ld) supports shared libraries... yes
checking whether -lc should be explicitly linked in... no
checking dynamic linker characteristics... freebsd13.0 ld.so
checking how to hardcode library paths into programs... immediate
checking whether stripping libraries is possible... no
checking if libtool supports shared libraries... yes
checking whether to build shared libraries... yes
checking whether to build static libraries... no

creating libtool
appending configuration tag "CXX" to libtool
checking whether the /nxb-bin/usr/bin/c++ linker (/nxb-bin/usr/bin/ld) supports shared libraries... yes
checking for /nxb-bin/usr/bin/c++ option to produce PIC... 
checking if /nxb-bin/usr/bin/c++ static flag  works... yes
checking if /nxb-bin/usr/bin/c++ supports -c -o file.o... yes
checking whether the /nxb-bin/usr/bin/c++ linker (/nxb-bin/usr/bin/ld) supports shared libraries... yes
checking dynamic linker characteristics... freebsd13.0 ld.so
(cached) (cached) checking how to hardcode library paths into programs... unsupported
configure: patching config.h.in
configure: creating ./config.status
config.status: creating config.h
===========================================================================
=======================<phase: build          >============================
===>  Building for php80-pecl-yaz-1.2.1
/bin/sh /wrkdirs/usr/ports/net/pecl-yaz/work-php80/yaz-1.2.1/libtool --mode=compile /nxb-bin/usr/bin/cc -I. -I/wrkdirs/usr/ports/net/pecl-yaz/work-php80/yaz-1.2.1 -I/wrkdirs/usr/ports/net/pecl-yaz/work-php80/yaz-1.2.1/include -I/wrkdirs/usr/ports/net/pecl-yaz/work-php80/yaz-1.2.1/main -I/wrkdirs/usr/ports/net/pecl-yaz/work-php80/yaz-1.2.1 -I/usr/local/include/php -I/usr/local/include/php/main -I/usr/local/include/php/TSRM -I/usr/local/include/php/Zend -I/usr/local/include/php/ext -I/usr/local/include/php/ext/date/lib -I/usr/local/include -I/usr/local/include/libxml2  -DHAVE_CONFIG_H  -O2 -pipe -fstack-protector-strong -fno-strict-aliasing    -c /wrkdirs/usr/ports/net/pecl-yaz/work-php80/yaz-1.2.1/php_yaz.c -o php_yaz.lo
mkdir .libs
 /nxb-bin/usr/bin/cc -I. -I/wrkdirs/usr/ports/net/pecl-yaz/work-php80/yaz-1.2.1 -I/wrkdirs/usr/ports/net/pecl-yaz/work-php80/yaz-1.2.1/include -I/wrkdirs/usr/ports/net/pecl-yaz/work-php80/yaz-1.2.1/main -I/wrkdirs/usr/ports/net/pecl-yaz/work-php80/yaz-1.2.1 -I/usr/local/include/php -I/usr/local/include/php/main -I/usr/local/include/php/TSRM -I/usr/local/include/php/Zend -I/usr/local/include/php/ext -I/usr/local/include/php/ext/date/lib -I/usr/local/include -I/usr/local/include/libxml2 -DHAVE_CONFIG_H -O2 -pipe -fstack-protector-strong -fno-strict-aliasing -c /wrkdirs/usr/ports/net/pecl-yaz/work-php80/yaz-1.2.1/php_yaz.c  -fPIC -DPIC -o .libs/php_yaz.o
/wrkdirs/usr/ports/net/pecl-yaz/work-php80/yaz-1.2.1/php_yaz.c:143:9: warning: implicit declaration of function 'ZEND_ARG_PASS_INFO' is invalid in C99 [-Wimplicit-function-declaration]
        ZEND_ARG_PASS_INFO(1)
        ^
/wrkdirs/usr/ports/net/pecl-yaz/work-php80/yaz-1.2.1/php_yaz.c:143:9: warning: incompatible integer to pointer conversion initializing 'const char *' with an expression of type 'int' [-Wint-conversion]
        ZEND_ARG_PASS_INFO(1)
        ^~~~~~~~~~~~~~~~~~~~~
/wrkdirs/usr/ports/net/pecl-yaz/work-php80/yaz-1.2.1/php_yaz.c:143:9: error: initializer element is not a compile-time constant
        ZEND_ARG_PASS_INFO(1)
        ^~~~~~~~~~~~~~~~~~~~~
/wrkdirs/usr/ports/net/pecl-yaz/work-php80/yaz-1.2.1/php_yaz.c:148:9: error: expected '}'
        ZEND_ARG_PASS_INFO(1)
        ^
/wrkdirs/usr/ports/net/pecl-yaz/work-php80/yaz-1.2.1/php_yaz.c:146:5: note: to match this '{'
    ZEND_BEGIN_ARG_INFO(second_argument_force_ref, 0)
    ^
/usr/local/include/php/Zend/zend_API.h:171:2: note: expanded from macro 'ZEND_BEGIN_ARG_INFO'
        ZEND_BEGIN_ARG_INFO_EX(name, {}, ZEND_RETURN_VALUE, -1)
        ^
/usr/local/include/php/Zend/zend_API.h:168:47: note: expanded from macro 'ZEND_BEGIN_ARG_INFO_EX'
        static const zend_internal_arg_info name[] = { \
                                                     ^
/wrkdirs/usr/ports/net/pecl-yaz/work-php80/yaz-1.2.1/php_yaz.c:153:9: error: expected '}'
        ZEND_ARG_PASS_INFO(0)
        ^
/wrkdirs/usr/ports/net/pecl-yaz/work-php80/yaz-1.2.1/php_yaz.c:151:5: note: to match this '{'
    ZEND_BEGIN_ARG_INFO(third_argument_force_ref, 0)
    ^
/usr/local/include/php/Zend/zend_API.h:171:2: note: expanded from macro 'ZEND_BEGIN_ARG_INFO'
        ZEND_BEGIN_ARG_INFO_EX(name, {}, ZEND_RETURN_VALUE, -1)
        ^
/usr/local/include/php/Zend/zend_API.h:168:47: note: expanded from macro 'ZEND_BEGIN_ARG_INFO_EX'
        static const zend_internal_arg_info name[] = { \
                                                     ^
/wrkdirs/usr/ports/net/pecl-yaz/work-php80/yaz-1.2.1/php_yaz.c:174:2: error: invalid application of 'sizeof' to an incomplete type 'const zend_internal_arg_info []'
        PHP_FE(yaz_hits, second_argument_force_ref)
        ^~~~~~~~~~~~~~~~~~~~~~~~~~~~~~~~~~~~~~~~~~~
/usr/local/include/php/main/php.h:384:18: note: expanded from macro 'PHP_FE'
#define PHP_FE                  ZEND_FE
                                ^
/usr/local/include/php/Zend/zend_API.h:83:38: note: expanded from macro 'ZEND_FE'
#define ZEND_FE(name, arg_info)                                         ZEND_RAW_FENTRY(#name, zif_##name, arg_info, 0)
                                                                        ^~~~~~~~~~~~~~~~~~~~~~~~~~~~~~~~~~~~~~~~~~~~~~~
/usr/local/include/php/Zend/zend_API.h:77:108: note: expanded from macro 'ZEND_RAW_FENTRY'
#define ZEND_RAW_FENTRY(zend_name, name, arg_info, flags)   { zend_name, name, arg_info, (uint32_t) (sizeof(arg_info)/sizeof(struct _zend_internal_arg_info)-1), flags },
                                                                                                           ^~~~~~~~~~
/wrkdirs/usr/ports/net/pecl-yaz/work-php80/yaz-1.2.1/php_yaz.c:182:2: error: invalid application of 'sizeof' to an incomplete type 'const zend_internal_arg_info []'
        PHP_FE(yaz_scan_result, second_argument_force_ref)
        ^~~~~~~~~~~~~~~~~~~~~~~~~~~~~~~~~~~~~~~~~~~~~~~~~~
/usr/local/include/php/main/php.h:384:18: note: expanded from macro 'PHP_FE'
#define PHP_FE                  ZEND_FE
                                ^
/usr/local/include/php/Zend/zend_API.h:83:38: note: expanded from macro 'ZEND_FE'
#define ZEND_FE(name, arg_info)                                         ZEND_RAW_FENTRY(#name, zif_##name, arg_info, 0)
                                                                        ^~~~~~~~~~~~~~~~~~~~~~~~~~~~~~~~~~~~~~~~~~~~~~~
/usr/local/include/php/Zend/zend_API.h:77:108: note: expanded from macro 'ZEND_RAW_FENTRY'
#define ZEND_RAW_FENTRY(zend_name, name, arg_info, flags)   { zend_name, name, arg_info, (uint32_t) (sizeof(arg_info)/sizeof(struct _zend_internal_arg_info)-1), flags },
                                                                                                           ^~~~~~~~~~
/wrkdirs/usr/ports/net/pecl-yaz/work-php80/yaz-1.2.1/php_yaz.c:185:2: error: invalid application of 'sizeof' to an incomplete type 'const zend_internal_arg_info []'
        PHP_FE(yaz_ccl_parse, third_argument_force_ref)
        ^~~~~~~~~~~~~~~~~~~~~~~~~~~~~~~~~~~~~~~~~~~~~~~
/usr/local/include/php/main/php.h:384:18: note: expanded from macro 'PHP_FE'
#define PHP_FE                  ZEND_FE
                                ^
/usr/local/include/php/Zend/zend_API.h:83:38: note: expanded from macro 'ZEND_FE'
#define ZEND_FE(name, arg_info)                                         ZEND_RAW_FENTRY(#name, zif_##name, arg_info, 0)
                                                                        ^~~~~~~~~~~~~~~~~~~~~~~~~~~~~~~~~~~~~~~~~~~~~~~
/usr/local/include/php/Zend/zend_API.h:77:108: note: expanded from macro 'ZEND_RAW_FENTRY'
#define ZEND_RAW_FENTRY(zend_name, name, arg_info, flags)   { zend_name, name, arg_info, (uint32_t) (sizeof(arg_info)/sizeof(struct _zend_internal_arg_info)-1), flags },
                                                                                                           ^~~~~~~~~~
/wrkdirs/usr/ports/net/pecl-yaz/work-php80/yaz-1.2.1/php_yaz.c:187:2: error: invalid application of 'sizeof' to an incomplete type 'const zend_internal_arg_info []'
        PHP_FE(yaz_cql_parse, third_argument_force_ref)
        ^~~~~~~~~~~~~~~~~~~~~~~~~~~~~~~~~~~~~~~~~~~~~~~
/usr/local/include/php/main/php.h:384:18: note: expanded from macro 'PHP_FE'
#define PHP_FE                  ZEND_FE
                                ^
/usr/local/include/php/Zend/zend_API.h:83:38: note: expanded from macro 'ZEND_FE'
#define ZEND_FE(name, arg_info)                                         ZEND_RAW_FENTRY(#name, zif_##name, arg_info, 0)
                                                                        ^~~~~~~~~~~~~~~~~~~~~~~~~~~~~~~~~~~~~~~~~~~~~~~
/usr/local/include/php/Zend/zend_API.h:77:108: note: expanded from macro 'ZEND_RAW_FENTRY'
#define ZEND_RAW_FENTRY(zend_name, name, arg_info, flags)   { zend_name, name, arg_info, (uint32_t) (sizeof(arg_info)/sizeof(struct _zend_internal_arg_info)-1), flags },
                                                                                                           ^~~~~~~~~~
/wrkdirs/usr/ports/net/pecl-yaz/work-php80/yaz-1.2.1/php_yaz.c:220:25: error: expected ')'
                php_error_docref(NULL TSRMLS_CC, E_WARNING, "Invalid YAZ handle");
                                      ^
/wrkdirs/usr/ports/net/pecl-yaz/work-php80/yaz-1.2.1/php_yaz.c:220:19: note: to match this '('
                php_error_docref(NULL TSRMLS_CC, E_WARNING, "Invalid YAZ handle");
                                ^
/wrkdirs/usr/ports/net/pecl-yaz/work-php80/yaz-1.2.1/php_yaz.c:385:31: error: expected ')'
                if (zend_parse_parameters(1 TSRMLS_CC, "s", &zurl_str, &zurl_len)
                                            ^
/wrkdirs/usr/ports/net/pecl-yaz/work-php80/yaz-1.2.1/php_yaz.c:385:28: note: to match this '('
                if (zend_parse_parameters(1 TSRMLS_CC, "s", &zurl_str, &zurl_len)
                                         ^
/wrkdirs/usr/ports/net/pecl-yaz/work-php80/yaz-1.2.1/php_yaz.c:391:31: error: expected ')'
                if (zend_parse_parameters(2 TSRMLS_CC, "sz", &zurl_str, &zurl_len,
                                            ^
/wrkdirs/usr/ports/net/pecl-yaz/work-php80/yaz-1.2.1/php_yaz.c:391:28: note: to match this '('
                if (zend_parse_parameters(2 TSRMLS_CC, "sz", &zurl_str, &zurl_len,
                                         ^
/wrkdirs/usr/ports/net/pecl-yaz/work-php80/yaz-1.2.1/php_yaz.c:440:25: error: expected ')'
                php_error_docref(NULL TSRMLS_CC, E_WARNING, "Empty zurl");
                                      ^
/wrkdirs/usr/ports/net/pecl-yaz/work-php80/yaz-1.2.1/php_yaz.c:440:19: note: to match this '('
                php_error_docref(NULL TSRMLS_CC, E_WARNING, "Empty zurl");
                                ^
/wrkdirs/usr/ports/net/pecl-yaz/work-php80/yaz-1.2.1/php_yaz.c:484:27: error: expected ')'
                                php_error_docref(NULL TSRMLS_CC, E_WARNING,
                                                      ^
/wrkdirs/usr/ports/net/pecl-yaz/work-php80/yaz-1.2.1/php_yaz.c:484:21: note: to match this '('
                                php_error_docref(NULL TSRMLS_CC, E_WARNING,
                                                ^
/wrkdirs/usr/ports/net/pecl-yaz/work-php80/yaz-1.2.1/php_yaz.c:546:54: error: expected ')'
        if (ZEND_NUM_ARGS() != 1 || zend_parse_parameters(1 TSRMLS_CC, "z", &id)
                                                            ^
/wrkdirs/usr/ports/net/pecl-yaz/work-php80/yaz-1.2.1/php_yaz.c:546:51: note: to match this '('
        if (ZEND_NUM_ARGS() != 1 || zend_parse_parameters(1 TSRMLS_CC, "z", &id)
                                                         ^
/wrkdirs/usr/ports/net/pecl-yaz/work-php80/yaz-1.2.1/php_yaz.c:574:33: error: expected ')'
        zend_parse_parameters(3 TSRMLS_CC, "zss", &id,
                                ^
/wrkdirs/usr/ports/net/pecl-yaz/work-php80/yaz-1.2.1/php_yaz.c:574:30: note: to match this '('
        zend_parse_parameters(3 TSRMLS_CC, "zss", &id,
                             ^
/wrkdirs/usr/ports/net/pecl-yaz/work-php80/yaz-1.2.1/php_yaz.c:619:25: error: expected ')'
                php_error_docref(NULL TSRMLS_CC, E_WARNING,
                                      ^
/wrkdirs/usr/ports/net/pecl-yaz/work-php80/yaz-1.2.1/php_yaz.c:619:19: note: to match this '('
                php_error_docref(NULL TSRMLS_CC, E_WARNING,
                                ^
/wrkdirs/usr/ports/net/pecl-yaz/work-php80/yaz-1.2.1/php_yaz.c:633:54: error: expected ')'
        if (ZEND_NUM_ARGS() != 1 || zend_parse_parameters(1 TSRMLS_CC, "z", &id)
                                                            ^
/wrkdirs/usr/ports/net/pecl-yaz/work-php80/yaz-1.2.1/php_yaz.c:633:51: note: to match this '('
        if (ZEND_NUM_ARGS() != 1 || zend_parse_parameters(1 TSRMLS_CC, "z", &id)
                                                         ^
/wrkdirs/usr/ports/net/pecl-yaz/work-php80/yaz-1.2.1/php_yaz.c:669:31: error: expected ')'
                if (zend_parse_parameters(1 TSRMLS_CC, "a/", &pval_options) ==
                                            ^
/wrkdirs/usr/ports/net/pecl-yaz/work-php80/yaz-1.2.1/php_yaz.c:669:28: note: to match this '('
                if (zend_parse_parameters(1 TSRMLS_CC, "a/", &pval_options) ==
                                         ^
/wrkdirs/usr/ports/net/pecl-yaz/work-php80/yaz-1.2.1/php_yaz.c:744:54: error: expected ')'
        if (ZEND_NUM_ARGS() != 1 || zend_parse_parameters(1 TSRMLS_CC, "z", &id)
                                                            ^
/wrkdirs/usr/ports/net/pecl-yaz/work-php80/yaz-1.2.1/php_yaz.c:744:51: note: to match this '('
        if (ZEND_NUM_ARGS() != 1 || zend_parse_parameters(1 TSRMLS_CC, "z", &id)
                                                         ^
/wrkdirs/usr/ports/net/pecl-yaz/work-php80/yaz-1.2.1/php_yaz.c:764:54: error: expected ')'
        if (ZEND_NUM_ARGS() != 1 || zend_parse_parameters(1 TSRMLS_CC, "z", &id)
                                                            ^
/wrkdirs/usr/ports/net/pecl-yaz/work-php80/yaz-1.2.1/php_yaz.c:764:51: note: to match this '('
        if (ZEND_NUM_ARGS() != 1 || zend_parse_parameters(1 TSRMLS_CC, "z", &id)
                                                         ^
fatal error: too many errors emitted, stopping now [-ferror-limit=]
2 warnings and 20 errors generated.
*** Error code 1

Stop.
make[1]: stopped in /wrkdirs/usr/ports/net/pecl-yaz/work-php80/yaz-1.2.1
*** Error code 1

Stop.
make: stopped in /usr/ports/net/pecl-yaz


More information about the freebsd-pkg-fallout mailing list