[package - head-i386-default][devel/pecl-grpc] Failed for php80-pecl-grpc-1.32.0 in build

pkg-fallout at FreeBSD.org pkg-fallout at FreeBSD.org
Tue Nov 3 14:24:40 UTC 2020


You are receiving this mail as a port that you maintain
is failing to build on the FreeBSD package build server.
Please investigate the failure and submit a PR to fix
build.

Maintainer:     vanilla at FreeBSD.org
Last committer: vanilla at FreeBSD.org
Ident:          $FreeBSD: head/devel/pecl-grpc/Makefile 548293 2020-09-12 07:15:54Z vanilla $
Log URL:        http://beefy17.nyi.freebsd.org/data/head-i386-default/p553941_s367285/logs/php80-pecl-grpc-1.32.0.log
Build URL:      http://beefy17.nyi.freebsd.org/build.html?mastername=head-i386-default&build=p553941_s367285
Log:

=>> Building devel/pecl-grpc
build started at Tue Nov  3 14:19:13 UTC 2020
port directory: /usr/ports/devel/pecl-grpc
package name: php80-pecl-grpc-1.32.0
building for: FreeBSD head-i386-default-job-13 13.0-CURRENT FreeBSD 13.0-CURRENT 1300124 i386
maintained by: vanilla at FreeBSD.org
Makefile ident:      $FreeBSD: head/devel/pecl-grpc/Makefile 548293 2020-09-12 07:15:54Z vanilla $
Poudriere version: 3.2.8-5-gc81843e5
Host OSVERSION: 1300121
Jail OSVERSION: 1300124
Job Id: 13




!!! Jail is newer than host. (Jail: 1300124, Host: 1300121) !!!
!!! This is not supported. !!!
!!! Host kernel must be same or newer than jail. !!!
!!! Expect build failures. !!!



---Begin Environment---
SHELL=/bin/csh
UNAME_p=i386
UNAME_m=i386
OSVERSION=1300124
UNAME_v=FreeBSD 13.0-CURRENT 1300124
UNAME_r=13.0-CURRENT
BLOCKSIZE=K
MAIL=/var/mail/root
STATUS=1
HOME=/root
PATH=/sbin:/bin:/usr/sbin:/usr/bin:/usr/local/sbin:/usr/local/bin:/root/bin
LOCALBASE=/usr/local
USER=root
LIBEXECPREFIX=/usr/local/libexec/poudriere
POUDRIERE_VERSION=3.2.8-5-gc81843e5
MASTERMNT=/usr/local/poudriere/data/.m/head-i386-default/ref
POUDRIERE_BUILD_TYPE=bulk
PACKAGE_BUILDING=yes
SAVED_TERM=
PWD=/usr/local/poudriere/data/.m/head-i386-default/ref/.p/pool
P_PORTS_FEATURES=FLAVORS SELECTED_OPTIONS
MASTERNAME=head-i386-default
SCRIPTPREFIX=/usr/local/share/poudriere
OLDPWD=/usr/local/poudriere/data/.m/head-i386-default/ref/.p
SCRIPTPATH=/usr/local/share/poudriere/bulk.sh
POUDRIEREPATH=/usr/local/bin/poudriere
---End Environment---

---Begin Poudriere Port Flags/Env---
PORT_FLAGS=
PKGENV=
FLAVOR=php80
DEPENDS_ARGS=
MAKE_ARGS= FLAVOR=php80
---End Poudriere Port Flags/Env---

---Begin OPTIONS List---
---End OPTIONS List---

--MAINTAINER--
vanilla at FreeBSD.org
--End MAINTAINER--

--CONFIGURE_ARGS--
--with-php-config=/usr/local/bin/php-config --prefix=/usr/local ${_LATE_CONFIGURE_ARGS}
--End CONFIGURE_ARGS--

--CONFIGURE_ENV--
XDG_DATA_HOME=/wrkdirs/usr/ports/devel/pecl-grpc/work-php80  XDG_CONFIG_HOME=/wrkdirs/usr/ports/devel/pecl-grpc/work-php80  HOME=/wrkdirs/usr/ports/devel/pecl-grpc/work-php80 TMPDIR="/tmp" PATH=/wrkdirs/usr/ports/devel/pecl-grpc/work-php80/.bin:/sbin:/bin:/usr/sbin:/usr/bin:/usr/local/sbin:/usr/local/bin:/root/bin SHELL=/bin/sh CONFIG_SHELL=/bin/sh CONFIG_SITE=/usr/ports/Templates/config.site lt_cv_sys_max_cmd_len=524288
--End CONFIGURE_ENV--

--MAKE_ENV--
XDG_DATA_HOME=/wrkdirs/usr/ports/devel/pecl-grpc/work-php80  XDG_CONFIG_HOME=/wrkdirs/usr/ports/devel/pecl-grpc/work-php80  HOME=/wrkdirs/usr/ports/devel/pecl-grpc/work-php80 TMPDIR="/tmp" PATH=/wrkdirs/usr/ports/devel/pecl-grpc/work-php80/.bin:/sbin:/bin:/usr/sbin:/usr/bin:/usr/local/sbin:/usr/local/bin:/root/bin NO_PIE=yes MK_DEBUG_FILES=no MK_KERNEL_SYMBOLS=no SHELL=/bin/sh NO_LINT=YES PREFIX=/usr/local  LOCALBASE=/usr/local  CC="cc" CFLAGS="-O2 -pipe  -fstack-protector-strong -fno-strict-aliasing "  CPP="cpp" CPPFLAGS=""  LDFLAGS=" -fstack-protector-strong " LIBS=""  CXX="c++" CXXFLAGS="-O2 -pipe -fstack-protector-strong -fno-strict-aliasing  "  MANPREFIX="/usr/local" BSD_INSTALL_PROGRAM="install  -s -m 555"  BSD_INSTALL_LIB="install  -s -m 0644"  BSD_INSTALL_SCRIPT="install  -m 555"  BSD_INSTALL_DATA="install  -m 0644"  BSD_INSTALL_MAN="install  -m 444"
--End MAKE_ENV--

--PLIST_SUB--
PHP_EXT_DIR=20200930 OSREL=13.0 PREFIX=%D LOCALBASE=/usr/local  RESETPREFIX=/usr/local LIB32DIR=lib DOCSDIR="share/doc/grpc"  EXAMPLESDIR="share/examples/grpc"  DATADIR="share/grpc"  WWWDIR="www/grpc"  ETCDIR="etc/grpc"
--End PLIST_SUB--

--SUB_LIST--
PHP_EXT_DIR=20200930 PREFIX=/usr/local LOCALBASE=/usr/local  DATADIR=/usr/local/share/grpc DOCSDIR=/usr/local/share/doc/grpc EXAMPLESDIR=/usr/local/share/examples/grpc  WWWDIR=/usr/local/www/grpc ETCDIR=/usr/local/etc/grpc
--End SUB_LIST--

---Begin make.conf---
USE_PACKAGE_DEPENDS=yes
BATCH=yes
WRKDIRPREFIX=/wrkdirs
PORTSDIR=/usr/ports
PACKAGES=/packages
DISTDIR=/distfiles
PACKAGE_BUILDING=yes
PACKAGE_BUILDING_FLAVORS=yes
MACHINE=i386
MACHINE_ARCH=i386
ARCH=${MACHINE_ARCH}
#### /usr/local/etc/poudriere.d/make.conf ####
# XXX: We really need this but cannot use it while 'make checksum' does not
# try the next mirror on checksum failure.  It currently retries the same
# failed mirror and then fails rather then trying another.  It *does*
# try the next if the size is mismatched though.
#MASTER_SITE_FREEBSD=yes
# Build ALLOW_MAKE_JOBS_PACKAGES with 2 jobs
MAKE_JOBS_NUMBER=2
#### /usr/ports/Mk/Scripts/ports_env.sh ####
_CCVERSION_921dbbb2=FreeBSD clang version 11.0.0 (git at github.com:llvm/llvm-project.git llvmorg-11.0.0-0-g176249bd673) Target: i386-unknown-freebsd13.0 Thread model: posix InstalledDir: /usr/bin
_ALTCCVERSION_921dbbb2=none
_CXXINTERNAL_acaad9ca=FreeBSD clang version 11.0.0 (git at github.com:llvm/llvm-project.git llvmorg-11.0.0-0-g176249bd673) Target: i386-unknown-freebsd13.0 Thread model: posix InstalledDir: /usr/bin "/usr/bin/ld" "--eh-frame-hdr" "-dynamic-linker" "/libexec/ld-elf.so.1" "--hash-style=both" "--enable-new-dtags" "-m" "elf_i386_fbsd" "-o" "a.out" "/usr/lib/crt1.o" "/usr/lib/crti.o" "/usr/lib/crtbegin.o" "-L/usr/lib" "/dev/null" "-lc++" "-lm" "-lgcc" "--as-needed" "-lgcc_s" "--no-as-needed" "-lc" "-lgcc" "--as-needed" "-lgcc_s" "--no-as-needed" "/usr/lib/crtend.o" "/usr/lib/crtn.o"
CC_OUTPUT_921dbbb2_58173849=yes
CC_OUTPUT_921dbbb2_9bdba57c=yes
CC_OUTPUT_921dbbb2_6a4fe7f5=yes
CC_OUTPUT_921dbbb2_6bcac02b=yes
CC_OUTPUT_921dbbb2_67d20829=yes
CC_OUTPUT_921dbbb2_bfa62e83=yes
CC_OUTPUT_921dbbb2_f0b4d593=yes
CC_OUTPUT_921dbbb2_308abb44=yes
CC_OUTPUT_921dbbb2_f00456e5=yes
CC_OUTPUT_921dbbb2_65ad290d=yes
CC_OUTPUT_921dbbb2_f2776b26=yes
CC_OUTPUT_921dbbb2_b2657cc3=yes
CC_OUTPUT_921dbbb2_380987f7=yes
CC_OUTPUT_921dbbb2_160933ec=yes
CC_OUTPUT_921dbbb2_fb62803b=yes
_OBJC_CCVERSION_921dbbb2=FreeBSD clang version 11.0.0 (git at github.com:llvm/llvm-project.git llvmorg-11.0.0-0-g176249bd673) Target: i386-unknown-freebsd13.0 Thread model: posix InstalledDir: /usr/bin
_OBJC_ALTCCVERSION_921dbbb2=none
ARCH=i386
OPSYS=FreeBSD
_OSRELEASE=13.0-CURRENT
OSREL=13.0
OSVERSION=1300124
PYTHONBASE=/usr/local
CONFIGURE_MAX_CMD_LEN=524288
HAVE_PORTS_ENV=1
#### Misc Poudriere ####
GID=0
UID=0
---End make.conf---
--Resource limits--
cpu time               (seconds, -t)  unlimited
file size           (512-blocks, -f)  unlimited
data seg size           (kbytes, -d)  524288
stack size              (kbytes, -s)  65536
core file size      (512-blocks, -c)  unlimited
max memory size         (kbytes, -m)  unlimited
locked memory           (kbytes, -l)  unlimited
max user processes              (-u)  89999
open files                      (-n)  1024
virtual mem size        (kbytes, -v)  unlimited
swap limit              (kbytes, -w)  unlimited
socket buffer size       (bytes, -b)  unlimited
pseudo-terminals                (-p)  unlimited
kqueues                         (-k)  unlimited
umtx shared locks               (-o)  unlimited
--End resource limits--
=======================<phase: check-sanity   >============================
===>  License APACHE20 accepted by the user
===========================================================================
=======================<phase: pkg-depends    >============================
===>   php80-pecl-grpc-1.32.0 depends on file: /usr/local/sbin/pkg - not found
===>   Installing existing package /packages/All/pkg-1.15.10.txz
[head-i386-default-job-13] Installing pkg-1.15.10...
[head-i386-default-job-13] Extracting pkg-1.15.10: .......... done
===>   php80-pecl-grpc-1.32.0 depends on file: /usr/local/sbin/pkg - found
===>   Returning to build of php80-pecl-grpc-1.32.0
===========================================================================
=======================<phase: fetch-depends  >============================
===========================================================================
=======================<phase: fetch          >============================
===>  License APACHE20 accepted by the user
===> Fetching all distfiles required by php80-pecl-grpc-1.32.0 for building
===========================================================================
=======================<phase: checksum       >============================
===>  License APACHE20 accepted by the user
===> Fetching all distfiles required by php80-pecl-grpc-1.32.0 for building
=> SHA256 Checksum OK for PECL/grpc-1.32.0.tgz.
===========================================================================
=======================<phase: extract-depends>============================
===========================================================================
=======================<phase: extract        >============================
===>  License APACHE20 accepted by the user
===> Fetching all distfiles required by php80-pecl-grpc-1.32.0 for building
===>  Extracting for php80-pecl-grpc-1.32.0
=> SHA256 Checksum OK for PECL/grpc-1.32.0.tgz.
===========================================================================
=======================<phase: patch-depends  >============================
===========================================================================
=======================<phase: patch          >============================
===>  Patching for php80-pecl-grpc-1.32.0
===>  Applying FreeBSD patches for php80-pecl-grpc-1.32.0 from /usr/ports/devel/pecl-grpc/files
===========================================================================
=======================<phase: build-depends  >============================
===>   php80-pecl-grpc-1.32.0 depends on file: /usr/local/bin/phpize - not found
===>   Installing existing package /packages/All/php80-8.0.0.r3.txz
[head-i386-default-job-13] Installing php80-8.0.0.r3...
[head-i386-default-job-13] `-- Installing libargon2-20190702...
[head-i386-default-job-13] `-- Extracting libargon2-20190702: .......... done
[head-i386-default-job-13] `-- Installing libxml2-2.9.10_1...
<snip>
                                                        ^
/wrkdirs/usr/ports/devel/pecl-grpc/work-php80/grpc-1.32.0/src/php/ext/grpc/call.h:47:25: note: to match this '('
zval *grpc_php_wrap_call(grpc_call *wrapped, bool owned TSRMLS_DC);
                        ^
/wrkdirs/usr/ports/devel/pecl-grpc/work-php80/grpc-1.32.0/src/php/ext/grpc/call.h:50:21: error: a parameter list without types is only allowed in a function definition
void grpc_init_call(TSRMLS_D);
                    ^
In file included from /wrkdirs/usr/ports/devel/pecl-grpc/work-php80/grpc-1.32.0/src/php/ext/grpc/call.c:31:
/wrkdirs/usr/ports/devel/pecl-grpc/work-php80/grpc-1.32.0/src/php/ext/grpc/call_credentials.h:59:33: error: a parameter list without types is only allowed in a function definition
void grpc_init_call_credentials(TSRMLS_D);
                                ^
In file included from /wrkdirs/usr/ports/devel/pecl-grpc/work-php80/grpc-1.32.0/src/php/ext/grpc/call.c:32:
/wrkdirs/usr/ports/devel/pecl-grpc/work-php80/grpc-1.32.0/src/php/ext/grpc/completion_queue.h:30:37: error: a parameter list without types is only allowed in a function definition
void grpc_php_init_completion_queue(TSRMLS_D);
                                    ^
/wrkdirs/usr/ports/devel/pecl-grpc/work-php80/grpc-1.32.0/src/php/ext/grpc/completion_queue.h:33:41: error: a parameter list without types is only allowed in a function definition
void grpc_php_shutdown_completion_queue(TSRMLS_D);
                                        ^
In file included from /wrkdirs/usr/ports/devel/pecl-grpc/work-php80/grpc-1.32.0/src/php/ext/grpc/call.c:33:
/wrkdirs/usr/ports/devel/pecl-grpc/work-php80/grpc-1.32.0/src/php/ext/grpc/timeval.h:39:24: error: a parameter list without types is only allowed in a function definition
void grpc_init_timeval(TSRMLS_D);
                       ^
/wrkdirs/usr/ports/devel/pecl-grpc/work-php80/grpc-1.32.0/src/php/ext/grpc/timeval.h:42:28: error: a parameter list without types is only allowed in a function definition
void grpc_shutdown_timeval(TSRMLS_D);
                           ^
/wrkdirs/usr/ports/devel/pecl-grpc/work-php80/grpc-1.32.0/src/php/ext/grpc/timeval.h:45:50: error: expected ')'
zval *grpc_php_wrap_timeval(gpr_timespec wrapped TSRMLS_DC);
                                                 ^
/wrkdirs/usr/ports/devel/pecl-grpc/work-php80/grpc-1.32.0/src/php/ext/grpc/timeval.h:45:28: note: to match this '('
zval *grpc_php_wrap_timeval(gpr_timespec wrapped TSRMLS_DC);
                           ^
/wrkdirs/usr/ports/devel/pecl-grpc/work-php80/grpc-1.32.0/src/php/ext/grpc/call.c:50:47: error: expected ')'
                                              TSRMLS_DC) {
                                              ^
/wrkdirs/usr/ports/devel/pecl-grpc/work-php80/grpc-1.32.0/src/php/ext/grpc/call.c:49:46: note: to match this '('
php_grpc_zend_object create_wrapped_grpc_call(zend_class_entry *class_type
                                             ^
/wrkdirs/usr/ports/devel/pecl-grpc/work-php80/grpc-1.32.0/src/php/ext/grpc/call.c:52:49: error: expected ')'
  zend_object_std_init(&intern->std, class_type TSRMLS_CC);
                                                ^
/wrkdirs/usr/ports/devel/pecl-grpc/work-php80/grpc-1.32.0/src/php/ext/grpc/call.c:52:23: note: to match this '('
  zend_object_std_init(&intern->std, class_type TSRMLS_CC);
                      ^
/wrkdirs/usr/ports/devel/pecl-grpc/work-php80/grpc-1.32.0/src/php/ext/grpc/call.c:60:49: error: expected ')'
                                *metadata_array TSRMLS_DC) {
                                                ^
/wrkdirs/usr/ports/devel/pecl-grpc/work-php80/grpc-1.32.0/src/php/ext/grpc/call.c:59:32: note: to match this '('
zval *grpc_parse_metadata_array(grpc_metadata_array
                               ^
/wrkdirs/usr/ports/devel/pecl-grpc/work-php80/grpc-1.32.0/src/php/ext/grpc/call.c:87:57: error: use of undeclared identifier 'TSRMLS_C'
        zend_throw_exception(zend_exception_get_default(TSRMLS_C),
                                                        ^
/wrkdirs/usr/ports/devel/pecl-grpc/work-php80/grpc-1.32.0/src/php/ext/grpc/call.c:184:57: error: expected ')'
zval *grpc_php_wrap_call(grpc_call *wrapped, bool owned TSRMLS_DC) {
                                                        ^
/wrkdirs/usr/ports/devel/pecl-grpc/work-php80/grpc-1.32.0/src/php/ext/grpc/call.c:184:25: note: to match this '('
zval *grpc_php_wrap_call(grpc_call *wrapped, bool owned TSRMLS_DC) {
                        ^
/wrkdirs/usr/ports/devel/pecl-grpc/work-php80/grpc-1.32.0/src/php/ext/grpc/call.c:214:45: error: expected ')'
  if (zend_parse_parameters(ZEND_NUM_ARGS() TSRMLS_CC, "OsO|s", &channel_obj,
                                            ^
/wrkdirs/usr/ports/devel/pecl-grpc/work-php80/grpc-1.32.0/src/php/ext/grpc/call.c:214:28: note: to match this '('
  if (zend_parse_parameters(ZEND_NUM_ARGS() TSRMLS_CC, "OsO|s", &channel_obj,
                           ^
/wrkdirs/usr/ports/devel/pecl-grpc/work-php80/grpc-1.32.0/src/php/ext/grpc/call.c:220:50: error: expected ')'
                         "an optional String", 1 TSRMLS_CC);
                                                 ^
/wrkdirs/usr/ports/devel/pecl-grpc/work-php80/grpc-1.32.0/src/php/ext/grpc/call.c:218:25: note: to match this '('
    zend_throw_exception(spl_ce_InvalidArgumentException,
                        ^
fatal error: too many errors emitted, stopping now [-ferror-limit=]
20 errors generated.
*** [src/php/ext/grpc/call.lo] Error code 1

make[1]: stopped in /wrkdirs/usr/ports/devel/pecl-grpc/work-php80/grpc-1.32.0
--- src/php/ext/grpc/call_credentials.lo ---
 cc -I. -I/wrkdirs/usr/ports/devel/pecl-grpc/work-php80/grpc-1.32.0 -I/wrkdirs/usr/ports/devel/pecl-grpc/work-php80/grpc-1.32.0/include -I/wrkdirs/usr/ports/devel/pecl-grpc/work-php80/grpc-1.32.0/main -I/wrkdirs/usr/ports/devel/pecl-grpc/work-php80/grpc-1.32.0 -I/usr/local/include/php -I/usr/local/include/php/main -I/usr/local/include/php/TSRM -I/usr/local/include/php/Zend -I/usr/local/include/php/ext -I/usr/local/include/php/ext/date/lib -I/wrkdirs/usr/ports/devel/pecl-grpc/work-php80/grpc-1.32.0/include -I/wrkdirs/usr/ports/devel/pecl-grpc/work-php80/grpc-1.32.0/src/core/ext/upb-generated -I/wrkdirs/usr/ports/devel/pecl-grpc/work-php80/grpc-1.32.0/src/core/ext/upbdefs-generated -I/wrkdirs/usr/ports/devel/pecl-grpc/work-php80/grpc-1.32.0/src/php/ext/grpc -I/wrkdirs/usr/ports/devel/pecl-grpc/work-php80/grpc-1.32.0/third_party/abseil-cpp -I/wrkdirs/usr/ports/devel/pecl-grpc/work-php80/grpc-1.32.0/third_party/address_sorting/include -I/wrkdirs/usr/ports/devel/pecl-grpc/work-php80/grpc-
 1.32.0/third_party/boringssl-with-bazel/src/include -I/wrkdirs/usr/ports/devel/pecl-grpc/work-php80/grpc-1.32.0/third_party/re2 -I/wrkdirs/usr/ports/devel/pecl-grpc/work-php80/grpc-1.32.0/third_party/upb -DHAVE_CONFIG_H -Wall -Werror -Wno-parentheses-equality -Wno-unused-value -std=c11 -g -O2 -fvisibility=hidden -DOPENSSL_NO_ASM -D_GNU_SOURCE -DWIN32_LEAN_AND_MEAN -D_HAS_EXCEPTIONS=0 -DNOMINMAX -DGRPC_ARES=0 -DGRPC_POSIX_FORK_ALLOW_PTHREAD_ATFORK=1 -c /wrkdirs/usr/ports/devel/pecl-grpc/work-php80/grpc-1.32.0/src/php/ext/grpc/call_credentials.c  -fPIC -DPIC -o src/php/ext/grpc/.libs/call_credentials.o
In file included from /wrkdirs/usr/ports/devel/pecl-grpc/work-php80/grpc-1.32.0/src/php/ext/grpc/call_credentials.c:24:
/wrkdirs/usr/ports/devel/pecl-grpc/work-php80/grpc-1.32.0/src/php/ext/grpc/call_credentials.h:59:33: error: a parameter list without types is only allowed in a function definition
void grpc_init_call_credentials(TSRMLS_D);
                                ^
In file included from /wrkdirs/usr/ports/devel/pecl-grpc/work-php80/grpc-1.32.0/src/php/ext/grpc/call_credentials.c:32:
In file included from /wrkdirs/usr/ports/devel/pecl-grpc/work-php80/grpc-1.32.0/src/php/ext/grpc/call.h:24:
In file included from /wrkdirs/usr/ports/devel/pecl-grpc/work-php80/grpc-1.32.0/src/php/ext/grpc/channel.h:22:
/wrkdirs/usr/ports/devel/pecl-grpc/work-php80/grpc-1.32.0/src/php/ext/grpc/channel_credentials.h:44:36: error: a parameter list without types is only allowed in a function definition
void grpc_init_channel_credentials(TSRMLS_D);
                                   ^
In file included from /wrkdirs/usr/ports/devel/pecl-grpc/work-php80/grpc-1.32.0/src/php/ext/grpc/call_credentials.c:32:
In file included from /wrkdirs/usr/ports/devel/pecl-grpc/work-php80/grpc-1.32.0/src/php/ext/grpc/call.h:24:
/wrkdirs/usr/ports/devel/pecl-grpc/work-php80/grpc-1.32.0/src/php/ext/grpc/channel.h:56:30: error: expected ')'
                             TSRMLS_DC);
                             ^
/wrkdirs/usr/ports/devel/pecl-grpc/work-php80/grpc-1.32.0/src/php/ext/grpc/channel.h:55:29: note: to match this '('
int php_grpc_read_args_array(zval *args_array, grpc_channel_args *args
                            ^
/wrkdirs/usr/ports/devel/pecl-grpc/work-php80/grpc-1.32.0/src/php/ext/grpc/channel.h:61:44: error: expected ')'
                                           TSRMLS_DC);
                                           ^
/wrkdirs/usr/ports/devel/pecl-grpc/work-php80/grpc-1.32.0/src/php/ext/grpc/channel.h:60:43: note: to match this '('
void php_grpc_delete_persistent_list_entry(char *key, php_grpc_int key_len
                                          ^
In file included from /wrkdirs/usr/ports/devel/pecl-grpc/work-php80/grpc-1.32.0/src/php/ext/grpc/call_credentials.c:32:
/wrkdirs/usr/ports/devel/pecl-grpc/work-php80/grpc-1.32.0/src/php/ext/grpc/call.h:44:69: error: expected ')'
zval *grpc_parse_metadata_array(grpc_metadata_array *metadata_array TSRMLS_DC);
                                                                    ^
/wrkdirs/usr/ports/devel/pecl-grpc/work-php80/grpc-1.32.0/src/php/ext/grpc/call.h:44:32: note: to match this '('
zval *grpc_parse_metadata_array(grpc_metadata_array *metadata_array TSRMLS_DC);
                               ^
/wrkdirs/usr/ports/devel/pecl-grpc/work-php80/grpc-1.32.0/src/php/ext/grpc/call.h:47:57: error: expected ')'
zval *grpc_php_wrap_call(grpc_call *wrapped, bool owned TSRMLS_DC);
                                                        ^
/wrkdirs/usr/ports/devel/pecl-grpc/work-php80/grpc-1.32.0/src/php/ext/grpc/call.h:47:25: note: to match this '('
zval *grpc_php_wrap_call(grpc_call *wrapped, bool owned TSRMLS_DC);
                        ^
/wrkdirs/usr/ports/devel/pecl-grpc/work-php80/grpc-1.32.0/src/php/ext/grpc/call.h:50:21: error: a parameter list without types is only allowed in a function definition
void grpc_init_call(TSRMLS_D);
                    ^
/wrkdirs/usr/ports/devel/pecl-grpc/work-php80/grpc-1.32.0/src/php/ext/grpc/call_credentials.c:47:34: error: expected ')'
    zend_class_entry *class_type TSRMLS_DC) {
                                 ^
/wrkdirs/usr/ports/devel/pecl-grpc/work-php80/grpc-1.32.0/src/php/ext/grpc/call_credentials.c:46:58: note: to match this '('
php_grpc_zend_object create_wrapped_grpc_call_credentials(
                                                         ^
/wrkdirs/usr/ports/devel/pecl-grpc/work-php80/grpc-1.32.0/src/php/ext/grpc/call_credentials.c:49:49: error: expected ')'
  zend_object_std_init(&intern->std, class_type TSRMLS_CC);
                                                ^
/wrkdirs/usr/ports/devel/pecl-grpc/work-php80/grpc-1.32.0/src/php/ext/grpc/call_credentials.c:49:23: note: to match this '('
  zend_object_std_init(&intern->std, class_type TSRMLS_CC);
                      ^
/wrkdirs/usr/ports/devel/pecl-grpc/work-php80/grpc-1.32.0/src/php/ext/grpc/call_credentials.c:56:47: error: expected ')'
                                     *wrapped TSRMLS_DC) {
                                              ^
/wrkdirs/usr/ports/devel/pecl-grpc/work-php80/grpc-1.32.0/src/php/ext/grpc/call_credentials.c:55:37: note: to match this '('
zval *grpc_php_wrap_call_credentials(grpc_call_credentials
                                    ^
/wrkdirs/usr/ports/devel/pecl-grpc/work-php80/grpc-1.32.0/src/php/ext/grpc/call_credentials.c:78:45: error: expected ')'
  if (zend_parse_parameters(ZEND_NUM_ARGS() TSRMLS_CC, "OO", &cred1_obj,
                                            ^
/wrkdirs/usr/ports/devel/pecl-grpc/work-php80/grpc-1.32.0/src/php/ext/grpc/call_credentials.c:78:28: note: to match this '('
  if (zend_parse_parameters(ZEND_NUM_ARGS() TSRMLS_CC, "OO", &cred1_obj,
                           ^
/wrkdirs/usr/ports/devel/pecl-grpc/work-php80/grpc-1.32.0/src/php/ext/grpc/call_credentials.c:83:28: error: expected ')'
                         1 TSRMLS_CC);
                           ^
/wrkdirs/usr/ports/devel/pecl-grpc/work-php80/grpc-1.32.0/src/php/ext/grpc/call_credentials.c:81:25: note: to match this '('
    zend_throw_exception(spl_ce_InvalidArgumentException,
                        ^
/wrkdirs/usr/ports/devel/pecl-grpc/work-php80/grpc-1.32.0/src/php/ext/grpc/call_credentials.c:93:61: error: expected ')'
  zval *creds_object = grpc_php_wrap_call_credentials(creds TSRMLS_CC);
                                                            ^
/wrkdirs/usr/ports/devel/pecl-grpc/work-php80/grpc-1.32.0/src/php/ext/grpc/call_credentials.c:93:54: note: to match this '('
  zval *creds_object = grpc_php_wrap_call_credentials(creds TSRMLS_CC);
                                                     ^
/wrkdirs/usr/ports/devel/pecl-grpc/work-php80/grpc-1.32.0/src/php/ext/grpc/call_credentials.c:112:45: error: expected ')'
  if (zend_parse_parameters(ZEND_NUM_ARGS() TSRMLS_CC, "f*", fci, fci_cache,
                                            ^
/wrkdirs/usr/ports/devel/pecl-grpc/work-php80/grpc-1.32.0/src/php/ext/grpc/call_credentials.c:112:28: note: to match this '('
  if (zend_parse_parameters(ZEND_NUM_ARGS() TSRMLS_CC, "f*", fci, fci_cache,
                           ^
/wrkdirs/usr/ports/devel/pecl-grpc/work-php80/grpc-1.32.0/src/php/ext/grpc/call_credentials.c:115:67: error: expected ')'
                         "createFromPlugin expects 1 callback", 1 TSRMLS_CC);
                                                                  ^
/wrkdirs/usr/ports/devel/pecl-grpc/work-php80/grpc-1.32.0/src/php/ext/grpc/call_credentials.c:114:25: note: to match this '('
    zend_throw_exception(spl_ce_InvalidArgumentException,
                        ^
/wrkdirs/usr/ports/devel/pecl-grpc/work-php80/grpc-1.32.0/src/php/ext/grpc/call_credentials.c:138:61: error: expected ')'
  zval *creds_object = grpc_php_wrap_call_credentials(creds TSRMLS_CC);
                                                            ^
/wrkdirs/usr/ports/devel/pecl-grpc/work-php80/grpc-1.32.0/src/php/ext/grpc/call_credentials.c:138:54: note: to match this '('
  zval *creds_object = grpc_php_wrap_call_credentials(creds TSRMLS_CC);
                                                     ^
/wrkdirs/usr/ports/devel/pecl-grpc/work-php80/grpc-1.32.0/src/php/ext/grpc/call_credentials.c:149:3: error: implicit declaration of function 'TSRMLS_FETCH' is invalid in C99 [-Werror,-Wimplicit-function-declaration]
  TSRMLS_FETCH();
  ^
/wrkdirs/usr/ports/devel/pecl-grpc/work-php80/grpc-1.32.0/src/php/ext/grpc/call_credentials.c:177:51: error: expected ')'
  zend_call_function(state->fci, state->fci_cache TSRMLS_CC);
                                                  ^
/wrkdirs/usr/ports/devel/pecl-grpc/work-php80/grpc-1.32.0/src/php/ext/grpc/call_credentials.c:177:21: note: to match this '('
  zend_call_function(state->fci, state->fci_cache TSRMLS_CC);
                    ^
/wrkdirs/usr/ports/devel/pecl-grpc/work-php80/grpc-1.32.0/src/php/ext/grpc/call_credentials.c:264:63: error: expected ')'
  grpc_ce_call_credentials = zend_register_internal_class(&ce TSRMLS_CC);
                                                              ^
/wrkdirs/usr/ports/devel/pecl-grpc/work-php80/grpc-1.32.0/src/php/ext/grpc/call_credentials.c:264:58: note: to match this '('
  grpc_ce_call_credentials = zend_register_internal_class(&ce TSRMLS_CC);
                                                         ^
19 errors generated.
*** [src/php/ext/grpc/call_credentials.lo] Error code 1

make[1]: stopped in /wrkdirs/usr/ports/devel/pecl-grpc/work-php80/grpc-1.32.0
2 errors

make[1]: stopped in /wrkdirs/usr/ports/devel/pecl-grpc/work-php80/grpc-1.32.0
===> Compilation failed unexpectedly.
Try to set MAKE_JOBS_UNSAFE=yes and rebuild before reporting the failure to
the maintainer.
*** Error code 1

Stop.
make: stopped in /usr/ports/devel/pecl-grpc


More information about the freebsd-pkg-fallout mailing list