[package - 113amd64-default][www/cliqz] Failed for cliqz-1.36.0_1 in build
pkg-fallout at FreeBSD.org
pkg-fallout at FreeBSD.org
Tue Jul 14 16:47:22 UTC 2020
You are receiving this mail as a port that you maintain
is failing to build on the FreeBSD package build server.
Please investigate the failure and submit a PR to fix
build.
Maintainer: fox at FreeBSD.org
Last committer: tobik at FreeBSD.org
Ident: $FreeBSD: head/www/cliqz/Makefile 537917 2020-06-04 18:08:00Z tobik $
Log URL: http://beefy9.nyi.freebsd.org/data/113amd64-default/542171/logs/cliqz-1.36.0_1.log
Build URL: http://beefy9.nyi.freebsd.org/build.html?mastername=113amd64-default&build=542171
Log:
=>> Building www/cliqz
build started at Tue Jul 14 15:43:19 UTC 2020
port directory: /usr/ports/www/cliqz
package name: cliqz-1.36.0_1
building for: FreeBSD 113amd64-default-job-13 11.3-RELEASE-p11 FreeBSD 11.3-RELEASE-p11 amd64
maintained by: fox at FreeBSD.org
Makefile ident: $FreeBSD: head/www/cliqz/Makefile 537917 2020-06-04 18:08:00Z tobik $
Poudriere version: 3.2.8-5-gc81843e5
Host OSVERSION: 1300094
Jail OSVERSION: 1103000
Job Id: 13
---Begin Environment---
SHELL=/bin/csh
OSVERSION=1103000
UNAME_v=FreeBSD 11.3-RELEASE-p11
UNAME_r=11.3-RELEASE-p11
BLOCKSIZE=K
MAIL=/var/mail/root
STATUS=1
HOME=/root
PATH=/sbin:/bin:/usr/sbin:/usr/bin:/usr/local/sbin:/usr/local/bin:/root/bin
LOCALBASE=/usr/local
USER=root
LIBEXECPREFIX=/usr/local/libexec/poudriere
POUDRIERE_VERSION=3.2.8-5-gc81843e5
MASTERMNT=/usr/local/poudriere/data/.m/113amd64-default/ref
POUDRIERE_BUILD_TYPE=bulk
PACKAGE_BUILDING=yes
SAVED_TERM=
PWD=/usr/local/poudriere/data/.m/113amd64-default/ref/.p/pool
P_PORTS_FEATURES=FLAVORS SELECTED_OPTIONS
MASTERNAME=113amd64-default
SCRIPTPREFIX=/usr/local/share/poudriere
OLDPWD=/usr/local/poudriere/data/.m/113amd64-default/ref/.p
SCRIPTPATH=/usr/local/share/poudriere/bulk.sh
POUDRIEREPATH=/usr/local/bin/poudriere
---End Environment---
---Begin Poudriere Port Flags/Env---
PORT_FLAGS=
PKGENV=
FLAVOR=
DEPENDS_ARGS=
MAKE_ARGS=
---End Poudriere Port Flags/Env---
---Begin OPTIONS List---
===> The following configuration options are available for cliqz-1.36.0_1:
====> Choose your audio options: you have to choose at least one of them
JACK=on: JACK audio server support
PULSEAUDIO=on: PulseAudio sound server support
SNDIO=on: Sndio audio support
===> Use 'make config' to modify these settings
---End OPTIONS List---
--MAINTAINER--
fox at FreeBSD.org
--End MAINTAINER--
--CONFIGURE_ARGS--
--End CONFIGURE_ARGS--
--CONFIGURE_ENV--
MAKE=gmake PKG_CONFIG=pkgconf PYTHON="/usr/local/bin/python2.7" XDG_DATA_HOME=/wrkdirs/usr/ports/www/cliqz/work XDG_CONFIG_HOME=/wrkdirs/usr/ports/www/cliqz/work HOME=/wrkdirs/usr/ports/www/cliqz/work TMPDIR="/tmp" PATH=/wrkdirs/usr/ports/www/cliqz/work/.bin:/sbin:/bin:/usr/sbin:/usr/bin:/usr/local/sbin:/usr/local/bin:/root/bin SHELL=/bin/sh CONFIG_SHELL=/bin/sh LANG=en_US.UTF-8 LC_ALL=en_US.UTF-8
--End CONFIGURE_ENV--
--MAKE_ENV--
CQZ_BUILD_ID=20200512121102 CQZ_RELEASE_CHANNEL=release LLVM_CONFIG=llvm-config90 LLVM_OBJDUMP=/usr/local/llvm90/bin/llvm-objdump PYTHON3="/usr/local/bin/python3.7" RUSTFLAGS= MOZBUILD_STATE_PATH=/wrkdirs/usr/ports/www/cliqz/work XDG_DATA_HOME=/wrkdirs/usr/ports/www/cliqz/work XDG_CONFIG_HOME=/wrkdirs/usr/ports/www/cliqz/work HOME=/wrkdirs/usr/ports/www/cliqz/work TMPDIR="/tmp" PATH=/wrkdirs/usr/ports/www/cliqz/work/.bin:/sbin:/bin:/usr/sbin:/usr/bin:/usr/local/sbin:/usr/local/bin:/root/bin NO_PIE=yes MK_DEBUG_FILES=no MK_KERNEL_SYMBOLS=no SHELL=/bin/sh NO_LINT=YES LANG=en_US.UTF-8 LC_ALL=en_US.UTF-8 PREFIX=/usr/local LOCALBASE=/usr/local CC="/usr/local/bin/clang90" CFLAGS="-O2 -pipe -fstack-protector-strong -fno-strict-aliasing " CPP="/usr/local/bin/clang-cpp90" CPPFLAGS="" LDFLAGS=" -fstack-protector-strong " LIBS="" CXX="/usr/local/bin/clang++90" CXXFLAGS="-O2 -pipe -fstack-protector-strong -fno-strict-aliasing " MANPREFIX="/usr/local" BSD_INSTALL_PROGRAM="install
-s -m 555" BSD_INSTALL_LIB="install -s -m 0644" BSD_INSTALL_SCRIPT="install -m 555" BSD_INSTALL_DATA="install -m 0644" BSD_INSTALL_MAN="install -m 444"
--End MAKE_ENV--
--PLIST_SUB--
GTK2_VERSION="2.10.0" GTK3_VERSION="3.0.0" PYTHON_INCLUDEDIR=include/python2.7 PYTHON_LIBDIR=lib/python2.7 PYTHON_PLATFORM=freebsd11 PYTHON_SITELIBDIR=lib/python2.7/site-packages PYTHON_SUFFIX=27 PYTHON_VER=2.7 PYTHON_VERSION=python2.7 PYTHON2="" PYTHON3="@comment " OSREL=11.3 PREFIX=%D LOCALBASE=/usr/local RESETPREFIX=/usr/local LIB32DIR=lib DOCSDIR="share/doc/cliqz" EXAMPLESDIR="share/examples/cliqz" DATADIR="share/cliqz" WWWDIR="www/cliqz" ETCDIR="etc/cliqz"
--End PLIST_SUB--
--SUB_LIST--
PREFIX=/usr/local LOCALBASE=/usr/local DATADIR=/usr/local/share/cliqz DOCSDIR=/usr/local/share/doc/cliqz EXAMPLESDIR=/usr/local/share/examples/cliqz WWWDIR=/usr/local/www/cliqz ETCDIR=/usr/local/etc/cliqz
--End SUB_LIST--
---Begin make.conf---
USE_PACKAGE_DEPENDS=yes
BATCH=yes
WRKDIRPREFIX=/wrkdirs
PORTSDIR=/usr/ports
PACKAGES=/packages
DISTDIR=/distfiles
PACKAGE_BUILDING=yes
PACKAGE_BUILDING_FLAVORS=yes
#### /usr/local/etc/poudriere.d/make.conf ####
# XXX: We really need this but cannot use it while 'make checksum' does not
# try the next mirror on checksum failure. It currently retries the same
# failed mirror and then fails rather then trying another. It *does*
# try the next if the size is mismatched though.
#MASTER_SITE_FREEBSD=yes
# Build ALLOW_MAKE_JOBS_PACKAGES with 2 jobs
MAKE_JOBS_NUMBER=2
#### /usr/ports/Mk/Scripts/ports_env.sh ####
_CCVERSION_921dbbb2=FreeBSD clang version 8.0.0 (tags/RELEASE_800/final 356365) (based on LLVM 8.0.0) Target: x86_64-unknown-freebsd11.3 Thread model: posix InstalledDir: /usr/bin
_ALTCCVERSION_921dbbb2=none
_CXXINTERNAL_acaad9ca=FreeBSD clang version 8.0.0 (tags/RELEASE_800/final 356365) (based on LLVM 8.0.0) Target: x86_64-unknown-freebsd11.3 Thread model: posix InstalledDir: /usr/bin "/usr/bin/ld" "--eh-frame-hdr" "-dynamic-linker" "/libexec/ld-elf.so.1" "--hash-style=both" "--enable-new-dtags" "-o" "a.out" "/usr/lib/crt1.o" "/usr/lib/crti.o" "/usr/lib/crtbegin.o" "-L/usr/lib" "/dev/null" "-lc++" "-lm" "-lgcc" "--as-needed" "-lgcc_s" "--no-as-needed" "-lc" "-lgcc" "--as-needed" "-lgcc_s" "--no-as-needed" "/usr/lib/crtend.o" "/usr/lib/crtn.o"
CC_OUTPUT_921dbbb2_58173849=yes
CC_OUTPUT_921dbbb2_9bdba57c=yes
CC_OUTPUT_921dbbb2_6a4fe7f5=yes
CC_OUTPUT_921dbbb2_6bcac02b=yes
CC_OUTPUT_921dbbb2_67d20829=yes
CC_OUTPUT_921dbbb2_bfa62e83=yes
CC_OUTPUT_921dbbb2_f0b4d593=yes
CC_OUTPUT_921dbbb2_308abb44=yes
CC_OUTPUT_921dbbb2_f00456e5=yes
CC_OUTPUT_921dbbb2_65ad290d=yes
CC_OUTPUT_921dbbb2_f2776b26=yes
CC_OUTPUT_921dbbb2_b2657cc3=yes
CC_OUTPUT_921dbbb2_380987f7=yes
CC_OUTPUT_921dbbb2_160933ec=yes
CC_OUTPUT_921dbbb2_fb62803b=yes
_OBJC_CCVERSION_921dbbb2=FreeBSD clang version 8.0.0 (tags/RELEASE_800/final 356365) (based on LLVM 8.0.0) Target: x86_64-unknown-freebsd11.3 Thread model: posix InstalledDir: /usr/bin
_OBJC_ALTCCVERSION_921dbbb2=none
ARCH=amd64
OPSYS=FreeBSD
_OSRELEASE=11.3-RELEASE-p11
OSREL=11.3
OSVERSION=1103000
PYTHONBASE=/usr/local
HAVE_COMPAT_IA32_KERN=YES
CONFIGURE_MAX_CMD_LEN=524288
HAVE_PORTS_ENV=1
#### Misc Poudriere ####
GID=0
UID=0
DISABLE_MAKE_JOBS=poudriere
---End make.conf---
--Resource limits--
cpu time (seconds, -t) unlimited
file size (512-blocks, -f) unlimited
data seg size (kbytes, -d) 33554432
stack size (kbytes, -s) 524288
core file size (512-blocks, -c) unlimited
max memory size (kbytes, -m) unlimited
locked memory (kbytes, -l) unlimited
max user processes (-u) 89999
open files (-n) 1024
virtual mem size (kbytes, -v) unlimited
swap limit (kbytes, -w) unlimited
socket buffer size (bytes, -b) unlimited
pseudo-terminals (-p) unlimited
kqueues (-k) unlimited
umtx shared locks (-o) unlimited
--End resource limits--
=======================<phase: check-sanity >============================
===> NOTICE:
This port is deprecated; you may wish to reconsider installing it:
Uses deprecated version of python.
It is scheduled to be removed on or after 2020-12-31.
===> License MPL20 accepted by the user
===========================================================================
=======================<phase: pkg-depends >============================
===> cliqz-1.36.0_1 depends on file: /usr/local/sbin/pkg - not found
===> Installing existing package /packages/All/pkg-1.14.6.txz
[113amd64-default-job-13] Installing pkg-1.14.6...
[113amd64-default-job-13] Extracting pkg-1.14.6: .......... done
===> cliqz-1.36.0_1 depends on file: /usr/local/sbin/pkg - found
===> Returning to build of cliqz-1.36.0_1
===========================================================================
=======================<phase: fetch-depends >============================
===> cliqz-1.36.0_1 depends on package: ca_root_nss>=0 - not found
===> Installing existing package /packages/All/ca_root_nss-3.54.txz
[113amd64-default-job-13] Installing ca_root_nss-3.54...
[113amd64-default-job-13] Extracting ca_root_nss-3.54: ........ done
=====
Message from ca_root_nss-3.54:
--
FreeBSD does not, and can not warrant that the certification authorities
whose certificates are included in this package have in any way been
audited for trustworthiness or RFC 3647 compliance.
Assessment and verification of trust is the complete responsibility of the
system administrator.
This package installs symlinks to support root certificates discovery by
default for software that uses OpenSSL.
This enables SSL Certificate Verification by client software without manual
intervention.
If you prefer to do this manually, replace the following symlinks with
either an empty file or your site-local certificate bundle.
* /etc/ssl/cert.pem
* /usr/local/etc/ssl/cert.pem
* /usr/local/openssl/cert.pem
===> cliqz-1.36.0_1 depends on package: ca_root_nss>=0 - found
===> Returning to build of cliqz-1.36.0_1
<snip>
52:08.91 In file included from BUILDSTATUS BUILD_VERBOSE parser/expat/lib
52:08.99 Unified_cpp_video_video_gn1.cppIn file included from Unified_cpp_voice_engine_gn0.cpp:2:
52:08.99 In file included from /wrkdirs/usr/ports/www/cliqz/work/browser-f-1.36.0/mozilla-release/media/webrtc/trunk/webrtc/voice_engine/channel.cc:30:
52:08.99 In file included from /wrkdirs/usr/ports/www/cliqz/work/browser-f-1.36.0/mozilla-release/media/webrtc/trunk/webrtc/modules/pacing/packet_router.h:18:
52:08.99 In file included from /wrkdirs/usr/ports/www/cliqz/work/browser-f-1.36.0/mozilla-release/media/webrtc/trunk/webrtc/modules/pacing/paced_sender.h:18:
52:08.99 /wrkdirs/usr/ports/www/cliqz/work/browser-f-1.36.0/mozilla-release/media/webrtc/trunk/webrtc/modules/pacing/packet_queue2.h:45:5: warning: explicitly defaulted default constructor is implicitly deleted [-Wdefaulted-function-deleted]
52:08.99 StreamPrioKey() = default;
52:08.99 ^
52:08.99 /wrkdirs/usr/ports/www/cliqz/work/browser-f-1.36.0/mozilla-release/media/webrtc/trunk/webrtc/modules/pacing/packet_queue2.h:55:37: note: default constructor of 'StreamPrioKey' is implicitly deleted because field 'priority' of const-qualified type 'const RtpPacketSender::Priority' would not be initialized
52:08.99 const RtpPacketSender::Priority priority;
52:08.99 ^
52:09.18 :In file included from Unified_cpp_video_video_gn0.cpp:38:
52:09.18 In file included from /wrkdirs/usr/ports/www/cliqz/work/browser-f-1.36.0/mozilla-release/media/webrtc/trunk/webrtc/video/receive_statistics_proxy.cc:18:
52:09.18 In file included from /wrkdirs/usr/ports/www/cliqz/work/browser-f-1.36.0/mozilla-release/media/webrtc/trunk/webrtc/modules/pacing/alr_detector.h:17:
52:09.18 In file included from /wrkdirs/usr/ports/www/cliqz/work/browser-f-1.36.0/mozilla-release/media/webrtc/trunk/webrtc/modules/pacing/paced_sender.h:18:
52:09.18 /wrkdirs/usr/ports/www/cliqz/work/browser-f-1.36.0/mozilla-release/media/webrtc/trunk/webrtc/modules/pacing/packet_queue2.h:45:5: warning: explicitly defaulted default constructor is implicitly deleted [-Wdefaulted-function-deleted]
52:09.19 StreamPrioKey() = default;
52:09.19 ^
52:09.19 /wrkdirs/usr/ports/www/cliqz/work/browser-f-1.36.0/mozilla-release/media/webrtc/trunk/webrtc/modules/pacing/packet_queue2.h:55:37: note: default constructor of 'StreamPrioKey' is implicitly deleted because field 'priority' of const-qualified type 'const RtpPacketSender::Priority' would not be initialized
52:09.19 const RtpPacketSender::Priority priority;
52:09.19 ^
52:09.37 2:
52:09.50 In file included from /wrkdirs/usr/ports/www/cliqz/work/browser-f-1.36.0/mozilla-release/media/webrtc/trunk/webrtc/video/video_stream_encoder.cc:21:
52:09.50 In file included from /wrkdirs/usr/ports/www/cliqz/work/browser-f-1.36.0/mozilla-release/media/webrtc/trunk/webrtc/modules/pacing/paced_sender.h:18:
52:09.50 /wrkdirs/usr/ports/www/cliqz/work/browser-f-1.36.0/mozilla-release/media/webrtc/trunk/webrtc/modules/pacing/packet_queue2.h:45:5: warning: explicitly defaulted default constructor is implicitly deleted [-Wdefaulted-function-deleted]
52:09.50 StreamPrioKey() = default;
52:09.50 ^
52:09.50 /wrkdirs/usr/ports/www/cliqz/work/browser-f-1.36.0/mozilla-release/media/webrtc/trunk/webrtc/modules/pacing/packet_queue2.h:55:37: note: default constructor of 'StreamPrioKey' is implicitly deleted because field 'priority' of const-qualified type 'const RtpPacketSender::Priority' would not be initialized
52:09.50 const RtpPacketSender::Priority priority;
52:09.50 ^
52:09.59 parser/expat/lib
52:10.77 parser/prototype
52:11.72 4 warnings generated.
52:13.87 parser/htmlparser
52:15.93 1 warning generated.
52:16.12 parser/html
52:16.49 gfx/cairo/cairo/src
52:17.46 gfx/cairo/libpixman/src
52:19.46 gfx/2d
52:22.07 1 warning generated.
52:25.82 gfx/ycbcr
52:26.49 gfx/angle/targets/translator
52:31.16 gfx/angle/targets/angle_common
52:31.50 gfx/angle/targets/preprocessor
52:43.27 gfx/src
52:44.05 gfx/qcms
52:44.21 1 warning generated.
52:45.12 /wrkdirs/usr/ports/www/cliqz/work/browser-f-1.36.0/mozilla-release/gfx/angle/checkout/src/compiler/preprocessor/ExpressionParser.cpp:1670:9: warning: code will never be executed [-Wunreachable-code]
52:45.12 goto yyerrorlab;
52:45.12 ^~~~~~~~~~~~~~~
52:45.12 /wrkdirs/usr/ports/www/cliqz/work/browser-f-1.36.0/mozilla-release/gfx/angle/checkout/src/compiler/preprocessor/ExpressionParser.cpp:1669:23: note: silence by adding parentheses to mark code as explicitly dead
52:45.12 if (/*CONSTCOND*/ 0)
52:45.12 ^
52:45.12 /* DISABLES CODE */ ( )
52:46.57 /wrkdirs/usr/ports/www/cliqz/work/browser-f-1.36.0/mozilla-release/gfx/cairo/libpixman/src/pixman-linear-gradient.cBUILDSTATUS OBJECT_FILE PackedGLEnums_autogen.o
52:46.59 :395:6: warning: code will never be executed [-Wunreachable-code]
52:46.59 if (iter->iter_flags & ITER_16)
52:46.59 ^~~~
52:46.59 /wrkdirs/usr/ports/www/cliqz/work/browser-f-1.36.0/mozilla-release/gfx/cairo/libpixman/src/pixman-linear-gradient.c:392:9: note: silence by adding parentheses to mark code as explicitly dead
52:46.59 if (0 && linear_gradient_is_horizontal (
52:46.59 ^
52:46.59 /* DISABLES CODE */ ( )
52:46.79 1 warning generated.
52:46.85 1 warning generated.
52:48.60 gfx/gl
52:54.01 gfx/layers
52:54.42 gfx/graphite2/src
52:55.25 gfx/harfbuzz/src
52:56.32 In file included from Unified_cpp_gfx_harfbuzz_src0.cpp:2:
52:56.32 In file included from /wrkdirs/usr/ports/www/cliqz/work/browser-f-1.36.0/mozilla-release/gfx/harfbuzz/src/hb-aat-layout.cc:30:
52:56.32 In file included from /wrkdirs/usr/ports/www/cliqz/work/browser-f-1.36.0/mozilla-release/gfx/harfbuzz/src/hb-aat-layout.hh:33:
52:56.32 In file included from /wrkdirs/usr/ports/www/cliqz/work/browser-f-1.36.0/mozilla-release/gfx/harfbuzz/src/hb-aat-ltag-table.hh:28:
52:56.32 In file included from /wrkdirs/usr/ports/www/cliqz/work/browser-f-1.36.0/mozilla-release/gfx/harfbuzz/src/hb-open-type.hh:34:
52:56.32 In file included from /wrkdirs/usr/ports/www/cliqz/work/browser-f-1.36.0/mozilla-release/gfx/harfbuzz/src/hb-face.hh:34:
52:56.32 In file included from /wrkdirs/usr/ports/www/cliqz/work/browser-f-1.36.0/mozilla-release/gfx/harfbuzz/src/hb-shaper.hh:31:
52:56.32 In file included from /wrkdirs/usr/ports/www/cliqz/work/browser-f-1.36.0/mozilla-release/gfx/harfbuzz/src/hb-machinery.hh:37:
52:56.32 /wrkdirs/usr/ports/www/cliqz/work/browser-f-1.36.0/mozilla-release/gfx/harfbuzz/src/hb-serialize.hh:122:63: warning: possible misuse of comma operator here [-Wcomma]
52:56.32 { return this->successful && (success || (err_other_error (), false)); }
52:56.33 ^
52:56.33 /wrkdirs/usr/ports/www/cliqz/work/browser-f-1.36.0/mozilla-release/gfx/harfbuzz/src/hb-serialize.hh:122:45: note: cast expression to void to silence warning
52:56.33 { return this->successful && (success || (err_other_error (), false)); }
52:56.33 ^~~~~~~~~~~~~~~~~~
52:56.33 static_cast<void>()
52:57.59 In file included from Unified_cpp_gfx_harfbuzz_src0.cpp:2:
52:57.59 In file included from /wrkdirs/usr/ports/www/cliqz/work/browser-f-1.36.0/mozilla-release/gfx/harfbuzz/src/hb-aat-layout.cc:36:
52:57.59 In file included from /wrkdirs/usr/ports/www/cliqz/work/browser-f-1.36.0/mozilla-release/gfx/harfbuzz/src/hb-aat-layout-kerx-table.hh:31:
52:57.59 In file included from /wrkdirs/usr/ports/www/cliqz/work/browser-f-1.36.0/mozilla-release/gfx/harfbuzz/src/hb-kern.hh:32:
52:57.59 In file included from /wrkdirs/usr/ports/www/cliqz/work/browser-f-1.36.0/mozilla-release/gfx/harfbuzz/src/hb-ot-layout-gpos-table.hh:32:
52:57.60 /wrkdirs/usr/ports/www/cliqz/work/browser-f-1.36.0/mozilla-release/gfx/harfbuzz/src/hb-ot-layout-gsubgpos.hh:1288:85: warning: possible misuse of comma operator here [-Wcomma]
52:57.60 && (c->buffer->unsafe_to_break (c->buffer->idx, c->buffer->idx + match_length),
52:57.60 ^
52:57.60 /wrkdirs/usr/ports/www/cliqz/work/browser-f-1.36.0/mozilla-release/gfx/harfbuzz/src/hb-ot-layout-gsubgpos.hh:1288:11: note: cast expression to void to silence warning
52:57.60 && (c->buffer->unsafe_to_break (c->buffer->idx, c->buffer->idx + match_length),
52:57.60 ^~~~~~~~~~~~~~~~~~~~~~~~~~~~~~~~~~~~~~~~~~~~~~~~~~~~~~~~~~~~~~~~~~~~~~~~~~
52:57.60 static_cast<void>( )
52:57.81 /wrkdirs/usr/ports/www/cliqz/work/browser-f-1.36.0/mozilla-release/gfx/harfbuzz/src/hb-ot-layout-gsubgpos.hh:1929:77: warning: possible misuse of comma operator here [-Wcomma]
52:57.81 && (c->buffer->unsafe_to_break_from_outbuffer (start_index, end_index),
52:57.81 ^
52:57.81 /wrkdirs/usr/ports/www/cliqz/work/browser-f-1.36.0/mozilla-release/gfx/harfbuzz/src/hb-ot-layout-gsubgpos.hh:1929:11: note: cast expression to void to silence warning
52:57.81 && (c->buffer->unsafe_to_break_from_outbuffer (start_index, end_index),
52:57.81 ^~~~~~~~~~~~~~~~~~~~~~~~~~~~~~~~~~~~~~~~~~~~~~~~~~~~~~~~~~~~~~~~~~
52:57.81 static_cast<void>( )
53:00.40 gfx/ots/src
53:00.78 /wrkdirs/usr/ports/www/cliqz/work/browser-f-1.36.0/mozilla-release/gfx/cairo/libpixman/src/pixman-x86.c:80:5: warning: macro expansion producing 'defined' has undefined behavior [-Wexpansion-to-defined]
53:00.78 #if _PIXMAN_X86_64 || defined (_MSC_VER)
53:00.78 ^
53:00.78 /wrkdirs/usr/ports/www/cliqz/work/browser-f-1.36.0/mozilla-release/gfx/cairo/libpixman/src/pixman-x86.c:75:6: note: expanded from macro '_PIXMAN_X86_64'
53:00.78 (defined(__amd64__) || defined(__x86_64__) || defined(_M_AMD64))
53:00.78 ^
53:00.78 /wrkdirs/usr/ports/www/cliqz/work/browser-f-1.36.0/mozilla-release/gfx/cairo/libpixman/src/pixman-x86.c:80:5: warning: macro expansion producing 'defined' has undefined behavior [-Wexpansion-to-defined]
53:00.78 /wrkdirs/usr/ports/www/cliqz/work/browser-f-1.36.0/mozilla-release/gfx/cairo/libpixman/src/pixman-x86.c:75:28: note: expanded from macro '_PIXMAN_X86_64'
53:00.78 (defined(__amd64__) || defined(__x86_64__) || defined(_M_AMD64))
53:00.78 ^
53:00.78 /wrkdirs/usr/ports/www/cliqz/work/browser-f-1.36.0/mozilla-release/gfx/cairo/libpixman/src/pixman-x86.c:80:5: warning: macro expansion producing 'defined' has undefined behavior [-Wexpansion-to-defined]
53:00.78 /wrkdirs/usr/ports/www/cliqz/work/browser-f-1.36.0/mozilla-release/gfx/cairo/libpixman/src/pixman-x86.c:75:51: note: expanded from macro '_PIXMAN_X86_64'
53:00.78 (defined(__amd64__) || defined(__x86_64__) || defined(_M_AMD64))
53:00.78 ^
53:00.78 /wrkdirs/usr/ports/www/cliqz/work/browser-f-1.36.0/mozilla-release/gfx/cairo/libpixman/src/pixman-x86.c:119:5: warning: macro expansion producing 'defined' has undefined behavior [-Wexpansion-to-defined]
53:00.78 #if _PIXMAN_X86_64
53:00.78 ^
53:00.78 /wrkdirs/usr/ports/www/cliqz/work/browser-f-1.36.0/mozilla-release/gfx/cairo/libpixman/src/pixman-x86.c:75:6: note: expanded from macro '_PIXMAN_X86_64'
53:00.78 (defined(__amd64__) || defined(__x86_64__) || defined(_M_AMD64))
53:00.78 ^
53:00.78 /wrkdirs/usr/ports/www/cliqz/work/browser-f-1.36.0/mozilla-release/gfx/cairo/libpixman/src/pixman-x86.c:119:5: warning: macro expansion producing 'defined' has undefined behavior [-Wexpansion-to-defined]
53:00.78 /wrkdirs/usr/ports/www/cliqz/work/browser-f-1.36.0/mozilla-release/gfx/cairo/libpixman/src/pixman-x86.c:75:28: note: expanded from macro '_PIXMAN_X86_64'
53:00.78 (defined(__amd64__) || defined(__x86_64__) || defined(_M_AMD64))
53:00.78 ^
53:00.78 /wrkdirs/usr/ports/www/cliqz/work/browser-f-1.36.0/mozilla-release/gfx/cairo/libpixman/src/pixman-x86.c:119:5: warning: macro expansion producing 'defined' has undefined behavior [-Wexpansion-to-defined]
53:00.78 /wrkdirs/usr/ports/www/cliqz/work/browser-f-1.36.0/mozilla-release/gfx/cairo/libpixman/src/pixman-x86.c:75:51: note: expanded from macro '_PIXMAN_X86_64'
53:00.78 (defined(__amd64__) || defined(__x86_64__) || defined(_M_AMD64))
53:00.79 ^
53:00.81 6 warnings generated.
53:03.46 In file included from Unified_cpp_gfx_ots_src0.cpp:20:
53:03.46 /wrkdirs/usr/ports/www/cliqz/work/browser-f-1.36.0/mozilla-release/gfx/ots/src/cff_charstring.cc:376:31: warning: comparison of integers of different signs: 'std::__1::__deque_base<int, std::__1::allocator<int> >::value_type' (aka 'int') and 'std::__1::vector<unsigned short, std::__1::allocator<unsigned short> >::size_type' (aka 'unsigned long') [-Wsign-compare]
53:03.46 if (argument_stack->top() >= cff.region_index_count.size()) {
53:03.46 ~~~~~~~~~~~~~~~~~~~~~ ^ ~~~~~~~~~~~~~~~~~~~~~~~~~~~~~
53:03.46 /wrkdirs/usr/ports/www/cliqz/work/browser-f-1.36.0/mozilla-release/gfx/ots/src/cff_charstring.cc:393:25: warning: comparison of integers of different signs: 'int32_t' (aka 'int') and 'std::__1::vector<unsigned short, std::__1::allocator<unsigned short> >::size_type' (aka 'unsigned long') [-Wsign-compare]
53:03.46 if (*in_out_vsindex >= cff.region_index_count.size()) {
53:03.46 ~~~~~~~~~~~~~~~ ^ ~~~~~~~~~~~~~~~~~~~~~~~~~~~~~
53:07.45 gfx/thebes
53:10.33 gfx/ipc
53:11.38 if (!yyg->yy_did_buffer_switch_on_eof)
53:11.38 ^~~
53:13.17 1 warning generated.
53:16.11 gfx/vr
53:19.14 gfx/vr/service
53:23.56 2 warnings generated.
53:42.22 gfx/config
54:02.11 gfx/webrender_bindings
54:04.09 gfx/skia
54:08.45 image
54:10.18 image/build
54:12.01 image/decoders
54:24.41 image/decoders/icon/gtk
54:28.15 image/decoders/icon
54:34.48 image/encoders/ico
54:37.87 image/encoders/png
54:44.53 image/encoders/jpeg
54:48.25 image/encoders/bmp
54:52.04 dom/abort
54:56.33 dom/animation
55:10.09 dom/base
55:10.09 dom/bindings
55:10.09 dom/battery
55:10.09 3 warnings generated.
55:10.09 dom/browser-element
55:10.09 /wrkdirs/usr/ports/www/cliqz/work/browser-f-1.36.0/mozilla-release/gfx/skia/skia/src/core/SkXfermode.cpp:138:12: warning: 'return' will never be executed [-Wunreachable-code-return]
55:10.09 return false;
55:10.09 ^~~~~
55:10.09 1 warning generated.
55:21.07 dom/cache
55:22.21 dom/canvas
56:42.17 dom/webgpu
56:58.64 dom/clients/api
57:38.23 error: could not compile `gkrust`.
57:41.89 Caused by:
57:41.89 process didn't exit successfully: `/usr/local/bin/rustc --crate-name gkrust toolkit/library/rust/lib.rs --error-format=json --json=diagnostic-rendered-ansi --crate-type staticlib --emit=dep-info,link -C opt-level=2 -C panic=abort -Clto --cfg 'feature="cubeb_pulse_rust"' --cfg 'feature="moz_places"' --cfg 'feature="new_cert_storage"' --cfg 'feature="quantum_render"' --cfg 'feature="simd-accel"' --cfg 'feature="webgpu"' --cfg 'feature="webrtc"' -C metadata=d1e611eaec876545 -C extra-filename=-d1e611eaec876545 --out-dir /wrkdirs/usr/ports/www/cliqz/work/browser-f-1.36.0/obj/x86_64-unknown-freebsd/release/deps --target x86_64-unknown-freebsd -C linker=/wrkdirs/usr/ports/www/cliqz/work/browser-f-1.36.0/mozilla-release/build/cargo-linker -L dependency=/wrkdirs/usr/ports/www/cliqz/work/browser-f-1.36.0/obj/x86_64-unknown-freebsd/release/deps -L dependency=/wrkdirs/usr/ports/www/cliqz/work/browser-f-1.36.0/obj/release/deps --extern gkrust_shared=/wrkdirs/usr/ports/www/cliqz/work/br
owser-f-1.36.0/obj/x86_64-unknown-freebsd/release/deps/libgkrust_shared-bf4b2f4b7cabff04.rlib --extern mozglue_static=/wrkdirs/usr/ports/www/cliqz/work/browser-f-1.36.0/obj/x86_64-unknown-freebsd/release/deps/libmozglue_static-f4243c893145860f.rlib --extern mozilla_central_workspace_hack=/wrkdirs/usr/ports/www/cliqz/work/browser-f-1.36.0/obj/x86_64-unknown-freebsd/release/deps/libmozilla_central_workspace_hack-ad006922ee8cbbd2.rlib -C opt-level=2 --cap-lints warn -C codegen-units=1 -L native=/wrkdirs/usr/ports/www/cliqz/work/browser-f-1.36.0/obj/x86_64-unknown-freebsd/release/build/lmdb-rkv-sys-06942f8690c3283c/out -L native=/wrkdirs/usr/ports/www/cliqz/work/browser-f-1.36.0/obj/x86_64-unknown-freebsd/release/build/mozglue-static-44d747a31be74a07/out -L native=/wrkdirs/usr/ports/www/cliqz/work/browser-f-1.36.0/obj/dist/bin -L native=/wrkdirs/usr/ports/www/cliqz/work/browser-f-1.36.0/obj/security/nss/lib/nss/nss_nss3 -L native=/wrkdirs/usr/ports/www/cliqz/work/browser-f-1.36.0/obj/se
curity/nss/lib/ssl/ssl_ssl3 -L native=/wrkdi!
rs/usr/ports/www/cliqz/work/browser-f-1.36.0/obj/config/external/nspr/pr -L native=/wrkdirs/usr/ports/www/cliqz/work/browser-f-1.36.0/obj/x86_64-unknown-freebsd/release/build/swgl-6a32272f53d2afea/out -L native=/usr/local/lib` (signal: 9, SIGKILL: kill)
57:41.89 gmake[5]: *** [/wrkdirs/usr/ports/www/cliqz/work/browser-f-1.36.0/mozilla-release/config/makefiles/rust.mk:294: force-cargo-library-build] Error 101
57:41.89 gmake[4]: *** [/wrkdirs/usr/ports/www/cliqz/work/browser-f-1.36.0/mozilla-release/config/recurse.mk:74: toolkit/library/rust/target] Error 2
57:41.89 gmake[4]: *** Waiting for unfinished jobs....
58:09.69 if ( ! yyg->yy_did_buffer_switch_on_eof )
58:32.05 ^~~
58:32.05 1 warning generated.
58:32.05 /wrkdirs/usr/ports/www/cliqz/work/browser-f-1.36.0/mozilla-release/gfx/angle/checkout/src/compiler/translator/glslang_tab.cpp:5082:6: warning: code will never be executed [-Wunreachable-code]
58:40.67 goto yyerrorlab;
58:40.67 ^~~~~~~~~~~~~~~
58:40.67 /wrkdirs/usr/ports/www/cliqz/work/browser-f-1.36.0/mozilla-release/gfx/angle/checkout/src/compiler/translator/glslang_tab.cpp:5081:21: note: silence by adding parentheses to mark code as explicitly dead
58:40.67 if (/*CONSTCOND*/ 0)
58:40.67 ^
58:40.67 /* DISABLES CODE */ ( )
58:40.67 1 warning generated.
61:14.04 gmake[3]: *** [/wrkdirs/usr/ports/www/cliqz/work/browser-f-1.36.0/mozilla-release/config/recurse.mk:34: compile] Error 2
61:14.04 gmake[2]: *** [/wrkdirs/usr/ports/www/cliqz/work/browser-f-1.36.0/mozilla-release/config/rules.mk:394: default] Error 2
61:14.04 gmake[1]: *** [client.mk:125: build] Error 2
61:14.08 178 compiler warnings present.
61:14.19 Notification center failed: Install notify-send (usually part of the libnotify package) to get a notification when the build finishes.
*** Error code 2
Stop.
make: stopped in /usr/ports/www/cliqz
More information about the freebsd-pkg-fallout
mailing list