[package - head-amd64-default][lang/spidermonkey60] Failed for spidermonkey60-60.9.0_3 in build
pkg-fallout at FreeBSD.org
pkg-fallout at FreeBSD.org
Thu Jun 4 02:00:38 UTC 2020
You are receiving this mail as a port that you maintain
is failing to build on the FreeBSD package build server.
Please investigate the failure and submit a PR to fix
build.
Maintainer: tcberner at FreeBSD.org
Last committer: jbeich at FreeBSD.org
Ident: $FreeBSD: head/lang/spidermonkey60/Makefile 532707 2020-04-23 20:14:49Z jbeich $
Log URL: http://beefy18.nyi.freebsd.org/data/head-amd64-default/p537862_s361780/logs/spidermonkey60-60.9.0_3.log
Build URL: http://beefy18.nyi.freebsd.org/build.html?mastername=head-amd64-default&build=p537862_s361780
Log:
=>> Building lang/spidermonkey60
build started at Thu Jun 4 01:54:57 UTC 2020
port directory: /usr/ports/lang/spidermonkey60
package name: spidermonkey60-60.9.0_3
building for: FreeBSD head-amd64-default-job-06 13.0-CURRENT FreeBSD 13.0-CURRENT 1300097 amd64
maintained by: tcberner at FreeBSD.org
Makefile ident: $FreeBSD: head/lang/spidermonkey60/Makefile 532707 2020-04-23 20:14:49Z jbeich $
Poudriere version: 3.2.8-5-gc81843e5
Host OSVERSION: 1300089
Jail OSVERSION: 1300097
Job Id: 06
!!! Jail is newer than host. (Jail: 1300097, Host: 1300089) !!!
!!! This is not supported. !!!
!!! Host kernel must be same or newer than jail. !!!
!!! Expect build failures. !!!
---Begin Environment---
SHELL=/bin/csh
OSVERSION=1300097
UNAME_v=FreeBSD 13.0-CURRENT 1300097
UNAME_r=13.0-CURRENT
BLOCKSIZE=K
MAIL=/var/mail/root
STATUS=1
HOME=/root
PATH=/sbin:/bin:/usr/sbin:/usr/bin:/usr/local/sbin:/usr/local/bin:/root/bin
LOCALBASE=/usr/local
USER=root
LIBEXECPREFIX=/usr/local/libexec/poudriere
POUDRIERE_VERSION=3.2.8-5-gc81843e5
MASTERMNT=/usr/local/poudriere/data/.m/head-amd64-default/ref
POUDRIERE_BUILD_TYPE=bulk
PACKAGE_BUILDING=yes
SAVED_TERM=
PWD=/usr/local/poudriere/data/.m/head-amd64-default/ref/.p/pool
P_PORTS_FEATURES=FLAVORS SELECTED_OPTIONS
MASTERNAME=head-amd64-default
SCRIPTPREFIX=/usr/local/share/poudriere
OLDPWD=/usr/local/poudriere/data/.m/head-amd64-default/ref/.p
SCRIPTPATH=/usr/local/share/poudriere/bulk.sh
POUDRIEREPATH=/usr/local/bin/poudriere
---End Environment---
---Begin Poudriere Port Flags/Env---
PORT_FLAGS=
PKGENV=
FLAVOR=
DEPENDS_ARGS=
MAKE_ARGS=
---End Poudriere Port Flags/Env---
---Begin OPTIONS List---
---End OPTIONS List---
--MAINTAINER--
tcberner at FreeBSD.org
--End MAINTAINER--
--CONFIGURE_ARGS--
--with-pthreads --prefix=/usr/local --target=x86_64-portbld-freebsd13.0 --with-intl-api --with-system-zlib --disable-gold --disable-debug --disable-debug-symbols --disable-jemalloc --with-system-icu --with-system-nspr --enable-shared-js --enable-optimize --enable-readline
--End CONFIGURE_ARGS--
--CONFIGURE_ENV--
HOST_CC=cc HOST_CXX=c++ MAKE=gmake PKG_CONFIG=pkgconf PYTHON="/usr/local/bin/python2.7" XDG_DATA_HOME=/wrkdirs/usr/ports/lang/spidermonkey60/work XDG_CONFIG_HOME=/wrkdirs/usr/ports/lang/spidermonkey60/work HOME=/wrkdirs/usr/ports/lang/spidermonkey60/work TMPDIR="/tmp" PATH=/wrkdirs/usr/ports/lang/spidermonkey60/work/.bin:/sbin:/bin:/usr/sbin:/usr/bin:/usr/local/sbin:/usr/local/bin:/root/bin SHELL=/bin/sh CONFIG_SHELL=/bin/sh CMAKE_PREFIX_PATH="/usr/local"
--End CONFIGURE_ENV--
--MAKE_ENV--
XDG_DATA_HOME=/wrkdirs/usr/ports/lang/spidermonkey60/work XDG_CONFIG_HOME=/wrkdirs/usr/ports/lang/spidermonkey60/work HOME=/wrkdirs/usr/ports/lang/spidermonkey60/work TMPDIR="/tmp" PATH=/wrkdirs/usr/ports/lang/spidermonkey60/work/.bin:/sbin:/bin:/usr/sbin:/usr/bin:/usr/local/sbin:/usr/local/bin:/root/bin NO_PIE=yes MK_DEBUG_FILES=no MK_KERNEL_SYMBOLS=no SHELL=/bin/sh NO_LINT=YES PREFIX=/usr/local LOCALBASE=/usr/local CC="cc" CFLAGS="-O2 -pipe -fstack-protector-strong -isystem /usr/local/include -fno-strict-aliasing " CPP="cpp" CPPFLAGS="-isystem /usr/local/include" LDFLAGS=" -fstack-protector-strong " LIBS="-L/usr/local/lib" CXX="c++" CXXFLAGS="-O2 -pipe -fstack-protector-strong -isystem /usr/local/include -fno-strict-aliasing -isystem /usr/local/include " MANPREFIX="/usr/local" BSD_INSTALL_PROGRAM="install -s -m 555" BSD_INSTALL_LIB="install -s -m 0644" BSD_INSTALL_SCRIPT="install -m 555" BSD_INSTALL_DATA="install -m 0644" BSD_INSTALL_MAN="install -m 444"
--End MAKE_ENV--
--PLIST_SUB--
PYTHON_INCLUDEDIR=include/python2.7 PYTHON_LIBDIR=lib/python2.7 PYTHON_PLATFORM=freebsd13 PYTHON_SITELIBDIR=lib/python2.7/site-packages PYTHON_SUFFIX=27 PYTHON_VER=2.7 PYTHON_VERSION=python2.7 PYTHON2="" PYTHON3="@comment " OSREL=13.0 PREFIX=%D LOCALBASE=/usr/local RESETPREFIX=/usr/local LIB32DIR=lib DOCSDIR="share/doc/spidermonkey" EXAMPLESDIR="share/examples/spidermonkey" DATADIR="share/spidermonkey" WWWDIR="www/spidermonkey" ETCDIR="etc/spidermonkey"
--End PLIST_SUB--
--SUB_LIST--
PREFIX=/usr/local LOCALBASE=/usr/local DATADIR=/usr/local/share/spidermonkey DOCSDIR=/usr/local/share/doc/spidermonkey EXAMPLESDIR=/usr/local/share/examples/spidermonkey WWWDIR=/usr/local/www/spidermonkey ETCDIR=/usr/local/etc/spidermonkey
--End SUB_LIST--
---Begin make.conf---
USE_PACKAGE_DEPENDS=yes
BATCH=yes
WRKDIRPREFIX=/wrkdirs
PORTSDIR=/usr/ports
PACKAGES=/packages
DISTDIR=/distfiles
PACKAGE_BUILDING=yes
PACKAGE_BUILDING_FLAVORS=yes
#### /usr/local/etc/poudriere.d/make.conf ####
# XXX: We really need this but cannot use it while 'make checksum' does not
# try the next mirror on checksum failure. It currently retries the same
# failed mirror and then fails rather then trying another. It *does*
# try the next if the size is mismatched though.
#MASTER_SITE_FREEBSD=yes
# Build ALLOW_MAKE_JOBS_PACKAGES with 2 jobs
MAKE_JOBS_NUMBER=2
#### /usr/ports/Mk/Scripts/ports_env.sh ####
_CCVERSION_921dbbb2=FreeBSD clang version 10.0.1 (git at github.com:llvm/llvm-project.git llvmorg-10.0.1-rc1-0-gf79cd71e145) Target: x86_64-unknown-freebsd13.0 Thread model: posix InstalledDir: /usr/bin
_ALTCCVERSION_921dbbb2=none
_CXXINTERNAL_acaad9ca=FreeBSD clang version 10.0.1 (git at github.com:llvm/llvm-project.git llvmorg-10.0.1-rc1-0-gf79cd71e145) Target: x86_64-unknown-freebsd13.0 Thread model: posix InstalledDir: /usr/bin "/usr/bin/ld" "--eh-frame-hdr" "-dynamic-linker" "/libexec/ld-elf.so.1" "--hash-style=both" "--enable-new-dtags" "-o" "a.out" "/usr/lib/crt1.o" "/usr/lib/crti.o" "/usr/lib/crtbegin.o" "-L/usr/lib" "/dev/null" "-lc++" "-lm" "-lgcc" "--as-needed" "-lgcc_s" "--no-as-needed" "-lc" "-lgcc" "--as-needed" "-lgcc_s" "--no-as-needed" "/usr/lib/crtend.o" "/usr/lib/crtn.o"
CC_OUTPUT_921dbbb2_58173849=yes
CC_OUTPUT_921dbbb2_9bdba57c=yes
CC_OUTPUT_921dbbb2_6a4fe7f5=yes
CC_OUTPUT_921dbbb2_6bcac02b=yes
CC_OUTPUT_921dbbb2_67d20829=yes
CC_OUTPUT_921dbbb2_bfa62e83=yes
CC_OUTPUT_921dbbb2_f0b4d593=yes
CC_OUTPUT_921dbbb2_308abb44=yes
CC_OUTPUT_921dbbb2_f00456e5=yes
CC_OUTPUT_921dbbb2_65ad290d=yes
CC_OUTPUT_921dbbb2_f2776b26=yes
CC_OUTPUT_921dbbb2_b2657cc3=yes
CC_OUTPUT_921dbbb2_380987f7=yes
CC_OUTPUT_921dbbb2_160933ec=yes
CC_OUTPUT_921dbbb2_fb62803b=yes
_OBJC_CCVERSION_921dbbb2=FreeBSD clang version 10.0.1 (git at github.com:llvm/llvm-project.git llvmorg-10.0.1-rc1-0-gf79cd71e145) Target: x86_64-unknown-freebsd13.0 Thread model: posix InstalledDir: /usr/bin
_OBJC_ALTCCVERSION_921dbbb2=none
ARCH=amd64
OPSYS=FreeBSD
_OSRELEASE=13.0-CURRENT
OSREL=13.0
OSVERSION=1300097
PYTHONBASE=/usr/local
HAVE_COMPAT_IA32_KERN=YES
CONFIGURE_MAX_CMD_LEN=524288
HAVE_PORTS_ENV=1
#### Misc Poudriere ####
GID=0
UID=0
---End make.conf---
--Resource limits--
cpu time (seconds, -t) unlimited
file size (512-blocks, -f) unlimited
data seg size (kbytes, -d) 33554432
stack size (kbytes, -s) 524288
core file size (512-blocks, -c) unlimited
max memory size (kbytes, -m) unlimited
locked memory (kbytes, -l) unlimited
max user processes (-u) 89999
open files (-n) 1024
virtual mem size (kbytes, -v) unlimited
swap limit (kbytes, -w) unlimited
socket buffer size (bytes, -b) unlimited
pseudo-terminals (-p) unlimited
kqueues (-k) unlimited
umtx shared locks (-o) unlimited
--End resource limits--
=======================<phase: check-sanity >============================
===> NOTICE:
This port is deprecated; you may wish to reconsider installing it:
Uses Python 2.7 which is EOLed upstream.
It is scheduled to be removed on or after 2020-12-31.
===> License MPL20 accepted by the user
===========================================================================
=======================<phase: pkg-depends >============================
===> spidermonkey60-60.9.0_3 depends on file: /usr/local/sbin/pkg - not found
===> Installing existing package /packages/All/pkg-1.14.4.txz
[head-amd64-default-job-06] Installing pkg-1.14.4...
[head-amd64-default-job-06] Extracting pkg-1.14.4: .......... done
===> spidermonkey60-60.9.0_3 depends on file: /usr/local/sbin/pkg - found
===> Returning to build of spidermonkey60-60.9.0_3
===========================================================================
=======================<phase: fetch-depends >============================
===========================================================================
=======================<phase: fetch >============================
===> NOTICE:
This port is deprecated; you may wish to reconsider installing it:
Uses Python 2.7 which is EOLed upstream.
It is scheduled to be removed on or after 2020-12-31.
===> License MPL20 accepted by the user
===> Fetching all distfiles required by spidermonkey60-60.9.0_3 for building
===========================================================================
=======================<phase: checksum >============================
===> NOTICE:
This port is deprecated; you may wish to reconsider installing it:
Uses Python 2.7 which is EOLed upstream.
It is scheduled to be removed on or after 2020-12-31.
===> License MPL20 accepted by the user
===> Fetching all distfiles required by spidermonkey60-60.9.0_3 for building
=> SHA256 Checksum OK for firefox-60.9.0esr.source.tar.xz.
===========================================================================
=======================<phase: extract-depends>============================
<snip>
if (skipCount < SIZE_MAX)
~ ^~~~~~~~
/usr/include/x86/_stdint.h:178:18: note: expanded from macro 'SIZE_MAX'
#define SIZE_MAX UINT64_MAX
^~~~~~~~~~
/usr/include/x86/_stdint.h:91:20: note: expanded from macro 'UINT64_MAX'
#define UINT64_MAX 0xffffffffffffffff
^~~~~~~~~~~~~~~~~~
1 warning generated.
/usr/bin/c++ -o Unified_cpp_js_src22.o -c -I/wrkdirs/usr/ports/lang/spidermonkey60/work/.build/dist/system_wrappers -include /wrkdirs/usr/ports/lang/spidermonkey60/work/firefox-60.9.0/config/gcc_hidden.h -DNDEBUG=1 -DTRIMMED=1 -DENABLE_WASM_GLOBAL -DWASM_HUGE_MEMORY -DENABLE_SHARED_ARRAY_BUFFER -DEXPORT_JS_API -DMOZ_HAS_MOZGLUE -I/wrkdirs/usr/ports/lang/spidermonkey60/work/firefox-60.9.0/js/src -I/wrkdirs/usr/ports/lang/spidermonkey60/work/.build/js/src -I/wrkdirs/usr/ports/lang/spidermonkey60/work/.build/dist/include -I/usr/local/include/nspr -fPIC -DMOZILLA_CLIENT -include /wrkdirs/usr/ports/lang/spidermonkey60/work/.build/js/src/js-confdefs.h -Qunused-arguments -isystem /usr/local/include -U_FORTIFY_SOURCE -D_FORTIFY_SOURCE=2 -Qunused-arguments -Wall -Wempty-body -Wignored-qualifiers -Woverloaded-virtual -Wpointer-arith -Wsign-compare -Wtype-limits -Wunreachable-code -Wunreachable-code-return -Wwrite-strings -Wno-invalid-offsetof -Wclass-varargs -Wloop-analysis -Wc++1z-compat -Wco
mma -Wimplicit-fallthrough -Wstring-conversion -Wno-inline-new-delete -Wno-error=deprecated-declarations -Wno-error=array-bounds -Wformat -Wformat-security -Wno-gnu-zero-variadic-macro-arguments -Wno-noexcept-type -Wno-unknown-warning-option -Wno-return-type-c-linkage -fno-sized-deallocation -O2 -pipe -fstack-protector-strong -isystem /usr/local/include -fno-strict-aliasing -isystem /usr/local/include -U_FORTIFY_SOURCE -D_FORTIFY_SOURCE=2 -fno-rtti -ffunction-sections -fdata-sections -fno-exceptions -fno-math-errno -pipe -I/usr/local/include -O -fomit-frame-pointer -I/usr/local/include -Wno-shadow -Werror=format -fno-strict-aliasing -MD -MP -MF .deps/Unified_cpp_js_src22.o.pp /wrkdirs/usr/ports/lang/spidermonkey60/work/.build/js/src/Unified_cpp_js_src22.cpp
In file included from /wrkdirs/usr/ports/lang/spidermonkey60/work/.build/js/src/Unified_cpp_js_src22.cpp:2:
In file included from /wrkdirs/usr/ports/lang/spidermonkey60/work/firefox-60.9.0/js/src/jit/ValueNumbering.cpp:7:
In file included from /wrkdirs/usr/ports/lang/spidermonkey60/work/firefox-60.9.0/js/src/jit/ValueNumbering.h:10:
In file included from /wrkdirs/usr/ports/lang/spidermonkey60/work/firefox-60.9.0/js/src/jit/JitAllocPolicy.h:17:
In file included from /wrkdirs/usr/ports/lang/spidermonkey60/work/firefox-60.9.0/js/src/jit/Ion.h:15:
In file included from /wrkdirs/usr/ports/lang/spidermonkey60/work/firefox-60.9.0/js/src/vm/JSCompartment.h:24:
In file included from /wrkdirs/usr/ports/lang/spidermonkey60/work/firefox-60.9.0/js/src/vm/GlobalObject.h:17:
In file included from /wrkdirs/usr/ports/lang/spidermonkey60/work/firefox-60.9.0/js/src/vm/ErrorObject.h:13:
In file included from /wrkdirs/usr/ports/lang/spidermonkey60/work/firefox-60.9.0/js/src/vm/SavedStacks.h:11:
/wrkdirs/usr/ports/lang/spidermonkey60/work/.build/dist/include/mozilla/FastBernoulliTrial.h:368:21: warning: implicit conversion from 'unsigned long' to 'double' changes value from 18446744073709551615 to 18446744073709551616 [-Wimplicit-int-float-conversion]
if (skipCount < SIZE_MAX)
~ ^~~~~~~~
/usr/include/x86/_stdint.h:178:18: note: expanded from macro 'SIZE_MAX'
#define SIZE_MAX UINT64_MAX
^~~~~~~~~~
/usr/include/x86/_stdint.h:91:20: note: expanded from macro 'UINT64_MAX'
#define UINT64_MAX 0xffffffffffffffff
^~~~~~~~~~~~~~~~~~
1 warning generated.
/usr/bin/c++ -o Unified_cpp_js_src23.o -c -I/wrkdirs/usr/ports/lang/spidermonkey60/work/.build/dist/system_wrappers -include /wrkdirs/usr/ports/lang/spidermonkey60/work/firefox-60.9.0/config/gcc_hidden.h -DNDEBUG=1 -DTRIMMED=1 -DENABLE_WASM_GLOBAL -DWASM_HUGE_MEMORY -DENABLE_SHARED_ARRAY_BUFFER -DEXPORT_JS_API -DMOZ_HAS_MOZGLUE -I/wrkdirs/usr/ports/lang/spidermonkey60/work/firefox-60.9.0/js/src -I/wrkdirs/usr/ports/lang/spidermonkey60/work/.build/js/src -I/wrkdirs/usr/ports/lang/spidermonkey60/work/.build/dist/include -I/usr/local/include/nspr -fPIC -DMOZILLA_CLIENT -include /wrkdirs/usr/ports/lang/spidermonkey60/work/.build/js/src/js-confdefs.h -Qunused-arguments -isystem /usr/local/include -U_FORTIFY_SOURCE -D_FORTIFY_SOURCE=2 -Qunused-arguments -Wall -Wempty-body -Wignored-qualifiers -Woverloaded-virtual -Wpointer-arith -Wsign-compare -Wtype-limits -Wunreachable-code -Wunreachable-code-return -Wwrite-strings -Wno-invalid-offsetof -Wclass-varargs -Wloop-analysis -Wc++1z-compat -Wco
mma -Wimplicit-fallthrough -Wstring-conversion -Wno-inline-new-delete -Wno-error=deprecated-declarations -Wno-error=array-bounds -Wformat -Wformat-security -Wno-gnu-zero-variadic-macro-arguments -Wno-noexcept-type -Wno-unknown-warning-option -Wno-return-type-c-linkage -fno-sized-deallocation -O2 -pipe -fstack-protector-strong -isystem /usr/local/include -fno-strict-aliasing -isystem /usr/local/include -U_FORTIFY_SOURCE -D_FORTIFY_SOURCE=2 -fno-rtti -ffunction-sections -fdata-sections -fno-exceptions -fno-math-errno -pipe -I/usr/local/include -O -fomit-frame-pointer -I/usr/local/include -Wno-shadow -Werror=format -fno-strict-aliasing -MD -MP -MF .deps/Unified_cpp_js_src23.o.pp /wrkdirs/usr/ports/lang/spidermonkey60/work/.build/js/src/Unified_cpp_js_src23.cpp
In file included from /wrkdirs/usr/ports/lang/spidermonkey60/work/.build/js/src/Unified_cpp_js_src23.cpp:2:
In file included from /wrkdirs/usr/ports/lang/spidermonkey60/work/firefox-60.9.0/js/src/jit/shared/Lowering-shared.cpp:7:
In file included from /wrkdirs/usr/ports/lang/spidermonkey60/work/firefox-60.9.0/js/src/jit/shared/Lowering-shared-inl.h:10:
In file included from /wrkdirs/usr/ports/lang/spidermonkey60/work/firefox-60.9.0/js/src/jit/shared/Lowering-shared.h:13:
In file included from /wrkdirs/usr/ports/lang/spidermonkey60/work/firefox-60.9.0/js/src/jit/LIR.h:15:
In file included from /wrkdirs/usr/ports/lang/spidermonkey60/work/firefox-60.9.0/js/src/jit/Bailouts.h:12:
In file included from /wrkdirs/usr/ports/lang/spidermonkey60/work/firefox-60.9.0/js/src/jit/JitFrames.h:13:
In file included from /wrkdirs/usr/ports/lang/spidermonkey60/work/firefox-60.9.0/js/src/jit/Safepoints.h:10:
In file included from /wrkdirs/usr/ports/lang/spidermonkey60/work/firefox-60.9.0/js/src/jit/BitSet.h:12:
In file included from /wrkdirs/usr/ports/lang/spidermonkey60/work/firefox-60.9.0/js/src/jit/JitAllocPolicy.h:17:
In file included from /wrkdirs/usr/ports/lang/spidermonkey60/work/firefox-60.9.0/js/src/jit/Ion.h:15:
In file included from /wrkdirs/usr/ports/lang/spidermonkey60/work/firefox-60.9.0/js/src/vm/JSCompartment.h:24:
In file included from /wrkdirs/usr/ports/lang/spidermonkey60/work/firefox-60.9.0/js/src/vm/GlobalObject.h:17:
In file included from /wrkdirs/usr/ports/lang/spidermonkey60/work/firefox-60.9.0/js/src/vm/ErrorObject.h:13:
In file included from /wrkdirs/usr/ports/lang/spidermonkey60/work/firefox-60.9.0/js/src/vm/SavedStacks.h:11:
/wrkdirs/usr/ports/lang/spidermonkey60/work/.build/dist/include/mozilla/FastBernoulliTrial.h:368:21: warning: implicit conversion from 'unsigned long' to 'double' changes value from 18446744073709551615 to 18446744073709551616 [-Wimplicit-int-float-conversion]
if (skipCount < SIZE_MAX)
~ ^~~~~~~~
/usr/include/x86/_stdint.h:178:18: note: expanded from macro 'SIZE_MAX'
#define SIZE_MAX UINT64_MAX
^~~~~~~~~~
/usr/include/x86/_stdint.h:91:20: note: expanded from macro 'UINT64_MAX'
#define UINT64_MAX 0xffffffffffffffff
^~~~~~~~~~~~~~~~~~
1 warning generated.
/usr/bin/c++ -o Unified_cpp_js_src24.o -c -I/wrkdirs/usr/ports/lang/spidermonkey60/work/.build/dist/system_wrappers -include /wrkdirs/usr/ports/lang/spidermonkey60/work/firefox-60.9.0/config/gcc_hidden.h -DNDEBUG=1 -DTRIMMED=1 -DENABLE_WASM_GLOBAL -DWASM_HUGE_MEMORY -DENABLE_SHARED_ARRAY_BUFFER -DEXPORT_JS_API -DMOZ_HAS_MOZGLUE -I/wrkdirs/usr/ports/lang/spidermonkey60/work/firefox-60.9.0/js/src -I/wrkdirs/usr/ports/lang/spidermonkey60/work/.build/js/src -I/wrkdirs/usr/ports/lang/spidermonkey60/work/.build/dist/include -I/usr/local/include/nspr -fPIC -DMOZILLA_CLIENT -include /wrkdirs/usr/ports/lang/spidermonkey60/work/.build/js/src/js-confdefs.h -Qunused-arguments -isystem /usr/local/include -U_FORTIFY_SOURCE -D_FORTIFY_SOURCE=2 -Qunused-arguments -Wall -Wempty-body -Wignored-qualifiers -Woverloaded-virtual -Wpointer-arith -Wsign-compare -Wtype-limits -Wunreachable-code -Wunreachable-code-return -Wwrite-strings -Wno-invalid-offsetof -Wclass-varargs -Wloop-analysis -Wc++1z-compat -Wco
mma -Wimplicit-fallthrough -Wstring-conversion -Wno-inline-new-delete -Wno-error=deprecated-declarations -Wno-error=array-bounds -Wformat -Wformat-security -Wno-gnu-zero-variadic-macro-arguments -Wno-noexcept-type -Wno-unknown-warning-option -Wno-return-type-c-linkage -fno-sized-deallocation -O2 -pipe -fstack-protector-strong -isystem /usr/local/include -fno-strict-aliasing -isystem /usr/local/include -U_FORTIFY_SOURCE -D_FORTIFY_SOURCE=2 -fno-rtti -ffunction-sections -fdata-sections -fno-exceptions -fno-math-errno -pipe -I/usr/local/include -O -fomit-frame-pointer -I/usr/local/include -Wno-shadow -Werror=format -fno-strict-aliasing -MD -MP -MF .deps/Unified_cpp_js_src24.o.pp /wrkdirs/usr/ports/lang/spidermonkey60/work/.build/js/src/Unified_cpp_js_src24.cpp
In file included from /wrkdirs/usr/ports/lang/spidermonkey60/work/.build/js/src/Unified_cpp_js_src24.cpp:2:
In file included from /wrkdirs/usr/ports/lang/spidermonkey60/work/firefox-60.9.0/js/src/jit/x64/Lowering-x64.cpp:7:
In file included from /wrkdirs/usr/ports/lang/spidermonkey60/work/firefox-60.9.0/js/src/jit/x64/Lowering-x64.h:10:
In file included from /wrkdirs/usr/ports/lang/spidermonkey60/work/firefox-60.9.0/js/src/jit/x86-shared/Lowering-x86-shared.h:10:
In file included from /wrkdirs/usr/ports/lang/spidermonkey60/work/firefox-60.9.0/js/src/jit/shared/Lowering-shared.h:13:
In file included from /wrkdirs/usr/ports/lang/spidermonkey60/work/firefox-60.9.0/js/src/jit/LIR.h:15:
In file included from /wrkdirs/usr/ports/lang/spidermonkey60/work/firefox-60.9.0/js/src/jit/Bailouts.h:12:
In file included from /wrkdirs/usr/ports/lang/spidermonkey60/work/firefox-60.9.0/js/src/jit/JitFrames.h:13:
In file included from /wrkdirs/usr/ports/lang/spidermonkey60/work/firefox-60.9.0/js/src/jit/Safepoints.h:10:
In file included from /wrkdirs/usr/ports/lang/spidermonkey60/work/firefox-60.9.0/js/src/jit/BitSet.h:12:
In file included from /wrkdirs/usr/ports/lang/spidermonkey60/work/firefox-60.9.0/js/src/jit/JitAllocPolicy.h:17:
In file included from /wrkdirs/usr/ports/lang/spidermonkey60/work/firefox-60.9.0/js/src/jit/Ion.h:15:
In file included from /wrkdirs/usr/ports/lang/spidermonkey60/work/firefox-60.9.0/js/src/vm/JSCompartment.h:24:
In file included from /wrkdirs/usr/ports/lang/spidermonkey60/work/firefox-60.9.0/js/src/vm/GlobalObject.h:17:
In file included from /wrkdirs/usr/ports/lang/spidermonkey60/work/firefox-60.9.0/js/src/vm/ErrorObject.h:13:
In file included from /wrkdirs/usr/ports/lang/spidermonkey60/work/firefox-60.9.0/js/src/vm/SavedStacks.h:11:
/wrkdirs/usr/ports/lang/spidermonkey60/work/.build/dist/include/mozilla/FastBernoulliTrial.h:368:21: warning: implicit conversion from 'unsigned long' to 'double' changes value from 18446744073709551615 to 18446744073709551616 [-Wimplicit-int-float-conversion]
if (skipCount < SIZE_MAX)
~ ^~~~~~~~
/usr/include/x86/_stdint.h:178:18: note: expanded from macro 'SIZE_MAX'
#define SIZE_MAX UINT64_MAX
^~~~~~~~~~
/usr/include/x86/_stdint.h:91:20: note: expanded from macro 'UINT64_MAX'
#define UINT64_MAX 0xffffffffffffffff
^~~~~~~~~~~~~~~~~~
1 warning generated.
/usr/bin/c++ -o Unified_cpp_js_src25.o -c -I/wrkdirs/usr/ports/lang/spidermonkey60/work/.build/dist/system_wrappers -include /wrkdirs/usr/ports/lang/spidermonkey60/work/firefox-60.9.0/config/gcc_hidden.h -DNDEBUG=1 -DTRIMMED=1 -DENABLE_WASM_GLOBAL -DWASM_HUGE_MEMORY -DENABLE_SHARED_ARRAY_BUFFER -DEXPORT_JS_API -DMOZ_HAS_MOZGLUE -I/wrkdirs/usr/ports/lang/spidermonkey60/work/firefox-60.9.0/js/src -I/wrkdirs/usr/ports/lang/spidermonkey60/work/.build/js/src -I/wrkdirs/usr/ports/lang/spidermonkey60/work/.build/dist/include -I/usr/local/include/nspr -fPIC -DMOZILLA_CLIENT -include /wrkdirs/usr/ports/lang/spidermonkey60/work/.build/js/src/js-confdefs.h -Qunused-arguments -isystem /usr/local/include -U_FORTIFY_SOURCE -D_FORTIFY_SOURCE=2 -Qunused-arguments -Wall -Wempty-body -Wignored-qualifiers -Woverloaded-virtual -Wpointer-arith -Wsign-compare -Wtype-limits -Wunreachable-code -Wunreachable-code-return -Wwrite-strings -Wno-invalid-offsetof -Wclass-varargs -Wloop-analysis -Wc++1z-compat -Wco
mma -Wimplicit-fallthrough -Wstring-conversion -Wno-inline-new-delete -Wno-error=deprecated-declarations -Wno-error=array-bounds -Wformat -Wformat-security -Wno-gnu-zero-variadic-macro-arguments -Wno-noexcept-type -Wno-unknown-warning-option -Wno-return-type-c-linkage -fno-sized-deallocation -O2 -pipe -fstack-protector-strong -isystem /usr/local/include -fno-strict-aliasing -isystem /usr/local/include -U_FORTIFY_SOURCE -D_FORTIFY_SOURCE=2 -fno-rtti -ffunction-sections -fdata-sections -fno-exceptions -fno-math-errno -pipe -I/usr/local/include -O -fomit-frame-pointer -I/usr/local/include -Wno-shadow -Werror=format -fno-strict-aliasing -MD -MP -MF .deps/Unified_cpp_js_src25.o.pp /wrkdirs/usr/ports/lang/spidermonkey60/work/.build/js/src/Unified_cpp_js_src25.cpp
In file included from /wrkdirs/usr/ports/lang/spidermonkey60/work/.build/js/src/Unified_cpp_js_src25.cpp:11:
In file included from /wrkdirs/usr/ports/lang/spidermonkey60/work/firefox-60.9.0/js/src/jit/x86-shared/BaselineCompiler-x86-shared.cpp:7:
In file included from /wrkdirs/usr/ports/lang/spidermonkey60/work/firefox-60.9.0/js/src/jit/x86-shared/BaselineCompiler-x86-shared.h:10:
In file included from /wrkdirs/usr/ports/lang/spidermonkey60/work/firefox-60.9.0/js/src/jit/shared/BaselineCompiler-shared.h:10:
In file included from /wrkdirs/usr/ports/lang/spidermonkey60/work/firefox-60.9.0/js/src/jit/BaselineFrameInfo.h:12:
In file included from /wrkdirs/usr/ports/lang/spidermonkey60/work/firefox-60.9.0/js/src/jit/BaselineFrame.h:10:
In file included from /wrkdirs/usr/ports/lang/spidermonkey60/work/firefox-60.9.0/js/src/jit/JitFrames.h:13:
In file included from /wrkdirs/usr/ports/lang/spidermonkey60/work/firefox-60.9.0/js/src/jit/Safepoints.h:10:
In file included from /wrkdirs/usr/ports/lang/spidermonkey60/work/firefox-60.9.0/js/src/jit/BitSet.h:12:
In file included from /wrkdirs/usr/ports/lang/spidermonkey60/work/firefox-60.9.0/js/src/jit/JitAllocPolicy.h:17:
In file included from /wrkdirs/usr/ports/lang/spidermonkey60/work/firefox-60.9.0/js/src/jit/Ion.h:15:
In file included from /wrkdirs/usr/ports/lang/spidermonkey60/work/firefox-60.9.0/js/src/vm/JSCompartment.h:24:
In file included from /wrkdirs/usr/ports/lang/spidermonkey60/work/firefox-60.9.0/js/src/vm/GlobalObject.h:17:
In file included from /wrkdirs/usr/ports/lang/spidermonkey60/work/firefox-60.9.0/js/src/vm/ErrorObject.h:13:
In file included from /wrkdirs/usr/ports/lang/spidermonkey60/work/firefox-60.9.0/js/src/vm/SavedStacks.h:11:
/wrkdirs/usr/ports/lang/spidermonkey60/work/.build/dist/include/mozilla/FastBernoulliTrial.h:368:21: warning: implicit conversion from 'unsigned long' to 'double' changes value from 18446744073709551615 to 18446744073709551616 [-Wimplicit-int-float-conversion]
if (skipCount < SIZE_MAX)
~ ^~~~~~~~
/usr/include/x86/_stdint.h:178:18: note: expanded from macro 'SIZE_MAX'
#define SIZE_MAX UINT64_MAX
^~~~~~~~~~
/usr/include/x86/_stdint.h:91:20: note: expanded from macro 'UINT64_MAX'
#define UINT64_MAX 0xffffffffffffffff
^~~~~~~~~~~~~~~~~~
1 warning generated.
/usr/bin/c++ -o Unified_cpp_js_src26.o -c -I/wrkdirs/usr/ports/lang/spidermonkey60/work/.build/dist/system_wrappers -include /wrkdirs/usr/ports/lang/spidermonkey60/work/firefox-60.9.0/config/gcc_hidden.h -DNDEBUG=1 -DTRIMMED=1 -DENABLE_WASM_GLOBAL -DWASM_HUGE_MEMORY -DENABLE_SHARED_ARRAY_BUFFER -DEXPORT_JS_API -DMOZ_HAS_MOZGLUE -I/wrkdirs/usr/ports/lang/spidermonkey60/work/firefox-60.9.0/js/src -I/wrkdirs/usr/ports/lang/spidermonkey60/work/.build/js/src -I/wrkdirs/usr/ports/lang/spidermonkey60/work/.build/dist/include -I/usr/local/include/nspr -fPIC -DMOZILLA_CLIENT -include /wrkdirs/usr/ports/lang/spidermonkey60/work/.build/js/src/js-confdefs.h -Qunused-arguments -isystem /usr/local/include -U_FORTIFY_SOURCE -D_FORTIFY_SOURCE=2 -Qunused-arguments -Wall -Wempty-body -Wignored-qualifiers -Woverloaded-virtual -Wpointer-arith -Wsign-compare -Wtype-limits -Wunreachable-code -Wunreachable-code-return -Wwrite-strings -Wno-invalid-offsetof -Wclass-varargs -Wloop-analysis -Wc++1z-compat -Wco
mma -Wimplicit-fallthrough -Wstring-conversion -Wno-inline-new-delete -Wno-error=deprecated-declarations -Wno-error=array-bounds -Wformat -Wformat-security -Wno-gnu-zero-variadic-macro-arguments -Wno-noexcept-type -Wno-unknown-warning-option -Wno-return-type-c-linkage -fno-sized-deallocation -O2 -pipe -fstack-protector-strong -isystem /usr/local/include -fno-strict-aliasing -isystem /usr/local/include -U_FORTIFY_SOURCE -D_FORTIFY_SOURCE=2 -fno-rtti -ffunction-sections -fdata-sections -fno-exceptions -fno-math-errno -pipe -I/usr/local/include -O -fomit-frame-pointer -I/usr/local/include -Wno-shadow -Werror=format -fno-strict-aliasing -MD -MP -MF .deps/Unified_cpp_js_src26.o.pp /wrkdirs/usr/ports/lang/spidermonkey60/work/.build/js/src/Unified_cpp_js_src26.cpp
In file included from /wrkdirs/usr/ports/lang/spidermonkey60/work/.build/js/src/Unified_cpp_js_src26.cpp:2:
In file included from /wrkdirs/usr/ports/lang/spidermonkey60/work/firefox-60.9.0/js/src/jit/x86-shared/MoveEmitter-x86-shared.cpp:7:
In file included from /wrkdirs/usr/ports/lang/spidermonkey60/work/firefox-60.9.0/js/src/jit/x86-shared/MoveEmitter-x86-shared.h:10:
In file included from /wrkdirs/usr/ports/lang/spidermonkey60/work/firefox-60.9.0/js/src/jit/MacroAssembler.h:14:
In file included from /wrkdirs/usr/ports/lang/spidermonkey60/work/firefox-60.9.0/js/src/vm/JSCompartment.h:24:
In file included from /wrkdirs/usr/ports/lang/spidermonkey60/work/firefox-60.9.0/js/src/vm/GlobalObject.h:17:
In file included from /wrkdirs/usr/ports/lang/spidermonkey60/work/firefox-60.9.0/js/src/vm/ErrorObject.h:13:
In file included from /wrkdirs/usr/ports/lang/spidermonkey60/work/firefox-60.9.0/js/src/vm/SavedStacks.h:11:
/wrkdirs/usr/ports/lang/spidermonkey60/work/.build/dist/include/mozilla/FastBernoulliTrial.h:368:21: warning: implicit conversion from 'unsigned long' to 'double' changes value from 18446744073709551615 to 18446744073709551616 [-Wimplicit-int-float-conversion]
if (skipCount < SIZE_MAX)
~ ^~~~~~~~
/usr/include/x86/_stdint.h:178:18: note: expanded from macro 'SIZE_MAX'
#define SIZE_MAX UINT64_MAX
^~~~~~~~~~
/usr/include/x86/_stdint.h:91:20: note: expanded from macro 'UINT64_MAX'
#define UINT64_MAX 0xffffffffffffffff
^~~~~~~~~~~~~~~~~~
1 warning generated.
/usr/bin/c++ -o Unified_cpp_js_src27.o -c -I/wrkdirs/usr/ports/lang/spidermonkey60/work/.build/dist/system_wrappers -include /wrkdirs/usr/ports/lang/spidermonkey60/work/firefox-60.9.0/config/gcc_hidden.h -DNDEBUG=1 -DTRIMMED=1 -DENABLE_WASM_GLOBAL -DWASM_HUGE_MEMORY -DENABLE_SHARED_ARRAY_BUFFER -DEXPORT_JS_API -DMOZ_HAS_MOZGLUE -I/wrkdirs/usr/ports/lang/spidermonkey60/work/firefox-60.9.0/js/src -I/wrkdirs/usr/ports/lang/spidermonkey60/work/.build/js/src -I/wrkdirs/usr/ports/lang/spidermonkey60/work/.build/dist/include -I/usr/local/include/nspr -fPIC -DMOZILLA_CLIENT -include /wrkdirs/usr/ports/lang/spidermonkey60/work/.build/js/src/js-confdefs.h -Qunused-arguments -isystem /usr/local/include -U_FORTIFY_SOURCE -D_FORTIFY_SOURCE=2 -Qunused-arguments -Wall -Wempty-body -Wignored-qualifiers -Woverloaded-virtual -Wpointer-arith -Wsign-compare -Wtype-limits -Wunreachable-code -Wunreachable-code-return -Wwrite-strings -Wno-invalid-offsetof -Wclass-varargs -Wloop-analysis -Wc++1z-compat -Wco
mma -Wimplicit-fallthrough -Wstring-conversion -Wno-inline-new-delete -Wno-error=deprecated-declarations -Wno-error=array-bounds -Wformat -Wformat-security -Wno-gnu-zero-variadic-macro-arguments -Wno-noexcept-type -Wno-unknown-warning-option -Wno-return-type-c-linkage -fno-sized-deallocation -O2 -pipe -fstack-protector-strong -isystem /usr/local/include -fno-strict-aliasing -isystem /usr/local/include -U_FORTIFY_SOURCE -D_FORTIFY_SOURCE=2 -fno-rtti -ffunction-sections -fdata-sections -fno-exceptions -fno-math-errno -pipe -I/usr/local/include -O -fomit-frame-pointer -I/usr/local/include -Wno-shadow -Werror=format -fno-strict-aliasing -MD -MP -MF .deps/Unified_cpp_js_src27.o.pp /wrkdirs/usr/ports/lang/spidermonkey60/work/.build/js/src/Unified_cpp_js_src27.cpp
In file included from /wrkdirs/usr/ports/lang/spidermonkey60/work/.build/js/src/Unified_cpp_js_src27.cpp:2:
In file included from /wrkdirs/usr/ports/lang/spidermonkey60/work/firefox-60.9.0/js/src/jsnum.cpp:30:
In file included from /wrkdirs/usr/ports/lang/spidermonkey60/work/firefox-60.9.0/js/src/vm/GlobalObject.h:17:
In file included from /wrkdirs/usr/ports/lang/spidermonkey60/work/firefox-60.9.0/js/src/vm/ErrorObject.h:13:
In file included from /wrkdirs/usr/ports/lang/spidermonkey60/work/firefox-60.9.0/js/src/vm/SavedStacks.h:11:
/wrkdirs/usr/ports/lang/spidermonkey60/work/.build/dist/include/mozilla/FastBernoulliTrial.h:368:21: warning: implicit conversion from 'unsigned long' to 'double' changes value from 18446744073709551615 to 18446744073709551616 [-Wimplicit-int-float-conversion]
if (skipCount < SIZE_MAX)
~ ^~~~~~~~
/usr/include/x86/_stdint.h:178:18: note: expanded from macro 'SIZE_MAX'
#define SIZE_MAX UINT64_MAX
^~~~~~~~~~
/usr/include/x86/_stdint.h:91:20: note: expanded from macro 'UINT64_MAX'
#define UINT64_MAX 0xffffffffffffffff
^~~~~~~~~~~~~~~~~~
1 warning generated.
/usr/bin/c++ -o Unified_cpp_js_src28.o -c -I/wrkdirs/usr/ports/lang/spidermonkey60/work/.build/dist/system_wrappers -include /wrkdirs/usr/ports/lang/spidermonkey60/work/firefox-60.9.0/config/gcc_hidden.h -DNDEBUG=1 -DTRIMMED=1 -DENABLE_WASM_GLOBAL -DWASM_HUGE_MEMORY -DENABLE_SHARED_ARRAY_BUFFER -DEXPORT_JS_API -DMOZ_HAS_MOZGLUE -I/wrkdirs/usr/ports/lang/spidermonkey60/work/firefox-60.9.0/js/src -I/wrkdirs/usr/ports/lang/spidermonkey60/work/.build/js/src -I/wrkdirs/usr/ports/lang/spidermonkey60/work/.build/dist/include -I/usr/local/include/nspr -fPIC -DMOZILLA_CLIENT -include /wrkdirs/usr/ports/lang/spidermonkey60/work/.build/js/src/js-confdefs.h -Qunused-arguments -isystem /usr/local/include -U_FORTIFY_SOURCE -D_FORTIFY_SOURCE=2 -Qunused-arguments -Wall -Wempty-body -Wignored-qualifiers -Woverloaded-virtual -Wpointer-arith -Wsign-compare -Wtype-limits -Wunreachable-code -Wunreachable-code-return -Wwrite-strings -Wno-invalid-offsetof -Wclass-varargs -Wloop-analysis -Wc++1z-compat -Wco
mma -Wimplicit-fallthrough -Wstring-conversion -Wno-inline-new-delete -Wno-error=deprecated-declarations -Wno-error=array-bounds -Wformat -Wformat-security -Wno-gnu-zero-variadic-macro-arguments -Wno-noexcept-type -Wno-unknown-warning-option -Wno-return-type-c-linkage -fno-sized-deallocation -O2 -pipe -fstack-protector-strong -isystem /usr/local/include -fno-strict-aliasing -isystem /usr/local/include -U_FORTIFY_SOURCE -D_FORTIFY_SOURCE=2 -fno-rtti -ffunction-sections -fdata-sections -fno-exceptions -fno-math-errno -pipe -I/usr/local/include -O -fomit-frame-pointer -I/usr/local/include -Wno-shadow -Werror=format -fno-strict-aliasing -MD -MP -MF .deps/Unified_cpp_js_src28.o.pp /wrkdirs/usr/ports/lang/spidermonkey60/work/.build/js/src/Unified_cpp_js_src28.cpp
1 warning generated.
/usr/bin/c++ -o Unified_cpp_js_src29.o -c -I/wrkdirs/usr/ports/lang/spidermonkey60/work/.build/dist/system_wrappers -include /wrkdirs/usr/ports/lang/spidermonkey60/work/firefox-60.9.0/config/gcc_hidden.h -DNDEBUG=1 -DTRIMMED=1 -DENABLE_WASM_GLOBAL -DWASM_HUGE_MEMORY -DENABLE_SHARED_ARRAY_BUFFER -DEXPORT_JS_API -DMOZ_HAS_MOZGLUE -I/wrkdirs/usr/ports/lang/spidermonkey60/work/firefox-60.9.0/js/src -I/wrkdirs/usr/ports/lang/spidermonkey60/work/.build/js/src -I/wrkdirs/usr/ports/lang/spidermonkey60/work/.build/dist/include -I/usr/local/include/nspr -fPIC -DMOZILLA_CLIENT -include /wrkdirs/usr/ports/lang/spidermonkey60/work/.build/js/src/js-confdefs.h -Qunused-arguments -isystem /usr/local/include -U_FORTIFY_SOURCE -D_FORTIFY_SOURCE=2 -Qunused-arguments -Wall -Wempty-body -Wignored-qualifiers -Woverloaded-virtual -Wpointer-arith -Wsign-compare -Wtype-limits -Wunreachable-code -Wunreachable-code-return -Wwrite-strings -Wno-invalid-offsetof -Wclass-varargs -Wloop-analysis -Wc++1z-compat -Wco
mma -Wimplicit-fallthrough -Wstring-conversion -Wno-inline-new-delete -Wno-error=deprecated-declarations -Wno-error=array-bounds -Wformat -Wformat-security -Wno-gnu-zero-variadic-macro-arguments -Wno-noexcept-type -Wno-unknown-warning-option -Wno-return-type-c-linkage -fno-sized-deallocation -O2 -pipe -fstack-protector-strong -isystem /usr/local/include -fno-strict-aliasing -isystem /usr/local/include -U_FORTIFY_SOURCE -D_FORTIFY_SOURCE=2 -fno-rtti -ffunction-sections -fdata-sections -fno-exceptions -fno-math-errno -pipe -I/usr/local/include -O -fomit-frame-pointer -I/usr/local/include -Wno-shadow -Werror=format -fno-strict-aliasing -MD -MP -MF .deps/Unified_cpp_js_src29.o.pp /wrkdirs/usr/ports/lang/spidermonkey60/work/.build/js/src/Unified_cpp_js_src29.cpp
In file included from /wrkdirs/usr/ports/lang/spidermonkey60/work/.build/js/src/Unified_cpp_js_src28.cpp:2:
In file included from /wrkdirs/usr/ports/lang/spidermonkey60/work/firefox-60.9.0/js/src/proxy/Proxy.cpp:24:
In file included from /wrkdirs/usr/ports/lang/spidermonkey60/work/firefox-60.9.0/js/src/vm/JSObject-inl.h:16:
In file included from /wrkdirs/usr/ports/lang/spidermonkey60/work/firefox-60.9.0/js/src/builtin/MapObject.h:11:
In file included from /wrkdirs/usr/ports/lang/spidermonkey60/work/firefox-60.9.0/js/src/vm/GlobalObject.h:17:
In file included from /wrkdirs/usr/ports/lang/spidermonkey60/work/firefox-60.9.0/js/src/vm/ErrorObject.h:13:
In file included from /wrkdirs/usr/ports/lang/spidermonkey60/work/firefox-60.9.0/js/src/vm/SavedStacks.h:11:
/wrkdirs/usr/ports/lang/spidermonkey60/work/.build/dist/include/mozilla/FastBernoulliTrial.h:368:21: warning: implicit conversion from 'unsigned long' to 'double' changes value from 18446744073709551615 to 18446744073709551616 [-Wimplicit-int-float-conversion]
if (skipCount < SIZE_MAX)
~ ^~~~~~~~
/usr/include/x86/_stdint.h:178:18: note: expanded from macro 'SIZE_MAX'
#define SIZE_MAX UINT64_MAX
^~~~~~~~~~
/usr/include/x86/_stdint.h:91:20: note: expanded from macro 'UINT64_MAX'
#define UINT64_MAX 0xffffffffffffffff
^~~~~~~~~~~~~~~~~~
In file included from /wrkdirs/usr/ports/lang/spidermonkey60/work/.build/js/src/Unified_cpp_js_src29.cpp:11:
/wrkdirs/usr/ports/lang/spidermonkey60/work/firefox-60.9.0/js/src/threading/posix/Thread.cpp:174:8: error: assigning to 'int' from incompatible type 'void'
rv = pthread_getname_np(pthread_self(), nameBuffer, len);
^~~~~~~~~~~~~~~~~~~~~~~~~~~~~~~~~~~~~~~~~~~~~~~~~~~
In file included from /wrkdirs/usr/ports/lang/spidermonkey60/work/.build/js/src/Unified_cpp_js_src29.cpp:47:
In file included from /wrkdirs/usr/ports/lang/spidermonkey60/work/firefox-60.9.0/js/src/util/StringBuffer.cpp:11:
In file included from /wrkdirs/usr/ports/lang/spidermonkey60/work/firefox-60.9.0/js/src/vm/JSObject-inl.h:16:
In file included from /wrkdirs/usr/ports/lang/spidermonkey60/work/firefox-60.9.0/js/src/builtin/MapObject.h:11:
In file included from /wrkdirs/usr/ports/lang/spidermonkey60/work/firefox-60.9.0/js/src/vm/GlobalObject.h:17:
In file included from /wrkdirs/usr/ports/lang/spidermonkey60/work/firefox-60.9.0/js/src/vm/ErrorObject.h:13:
In file included from /wrkdirs/usr/ports/lang/spidermonkey60/work/firefox-60.9.0/js/src/vm/SavedStacks.h:11:
/wrkdirs/usr/ports/lang/spidermonkey60/work/.build/dist/include/mozilla/FastBernoulliTrial.h:368:21: warning: implicit conversion from 'unsigned long' to 'double' changes value from 18446744073709551615 to 18446744073709551616 [-Wimplicit-int-float-conversion]
if (skipCount < SIZE_MAX)
~ ^~~~~~~~
/usr/include/x86/_stdint.h:178:18: note: expanded from macro 'SIZE_MAX'
#define SIZE_MAX UINT64_MAX
^~~~~~~~~~
/usr/include/x86/_stdint.h:91:20: note: expanded from macro 'UINT64_MAX'
#define UINT64_MAX 0xffffffffffffffff
^~~~~~~~~~~~~~~~~~
1 warning and 1 error generated.
gmake[4]: *** [/wrkdirs/usr/ports/lang/spidermonkey60/work/firefox-60.9.0/config/rules.mk:1056: Unified_cpp_js_src29.o] Error 1
gmake[4]: *** Waiting for unfinished jobs....
1 warning generated.
gmake[4]: Leaving directory '/wrkdirs/usr/ports/lang/spidermonkey60/work/.build/js/src'
gmake[3]: *** [/wrkdirs/usr/ports/lang/spidermonkey60/work/firefox-60.9.0/config/recurse.mk:73: js/src/target] Error 2
gmake[3]: Leaving directory '/wrkdirs/usr/ports/lang/spidermonkey60/work/.build'
gmake[2]: *** [/wrkdirs/usr/ports/lang/spidermonkey60/work/firefox-60.9.0/config/recurse.mk:33: compile] Error 2
gmake[2]: Leaving directory '/wrkdirs/usr/ports/lang/spidermonkey60/work/.build'
gmake[1]: *** [/wrkdirs/usr/ports/lang/spidermonkey60/work/firefox-60.9.0/config/rules.mk:442: all] Error 2
gmake[1]: Leaving directory '/wrkdirs/usr/ports/lang/spidermonkey60/work/.build'
===> Compilation failed unexpectedly.
Try to set MAKE_JOBS_UNSAFE=yes and rebuild before reporting the failure to
the maintainer.
*** Error code 1
Stop.
make: stopped in /usr/ports/lang/spidermonkey60
More information about the freebsd-pkg-fallout
mailing list