[package - head-powerpc64-default][www/firefox-esr] Failed for firefox-esr-68.6.0_3, 1 in build
pkg-fallout at FreeBSD.org
pkg-fallout at FreeBSD.org
Fri Apr 3 07:51:50 UTC 2020
You are receiving this mail as a port that you maintain
is failing to build on the FreeBSD package build server.
Please investigate the failure and submit a PR to fix
build.
Maintainer: gecko at FreeBSD.org
Last committer: jbeich at FreeBSD.org
Ident: $FreeBSD: head/www/firefox-esr/Makefile 528343 2020-03-13 09:47:16Z jbeich $
Log URL: http://pylon.nyi.freebsd.org/data/head-powerpc64-default/p529066_s359288/logs/firefox-esr-68.6.0_3,1.log
Build URL: http://pylon.nyi.freebsd.org/build.html?mastername=head-powerpc64-default&build=p529066_s359288
Log:
=>> Building www/firefox-esr
build started at Fri Apr 3 07:01:36 UTC 2020
port directory: /usr/ports/www/firefox-esr
package name: firefox-esr-68.6.0_3,1
building for: FreeBSD head-powerpc64-default-job-13 13.0-CURRENT FreeBSD 13.0-CURRENT 1300085 powerpc
maintained by: gecko at FreeBSD.org
Makefile ident: $FreeBSD: head/www/firefox-esr/Makefile 528343 2020-03-13 09:47:16Z jbeich $
Poudriere version: 3.2.8-5-gc81843e5
Host OSVERSION: 1300084
Jail OSVERSION: 1300085
Job Id: 13
!!! Jail is newer than host. (Jail: 1300085, Host: 1300084) !!!
!!! This is not supported. !!!
!!! Host kernel must be same or newer than jail. !!!
!!! Expect build failures. !!!
---Begin Environment---
SHELL=/bin/csh
OSVERSION=1300085
UNAME_v=FreeBSD 13.0-CURRENT 1300085
UNAME_r=13.0-CURRENT
BLOCKSIZE=K
MAIL=/var/mail/root
STATUS=1
HOME=/root
PATH=/sbin:/bin:/usr/sbin:/usr/bin:/usr/local/sbin:/usr/local/bin:/root/bin
LOCALBASE=/usr/local
USER=root
LIBEXECPREFIX=/usr/local/libexec/poudriere
POUDRIERE_VERSION=3.2.8-5-gc81843e5
MASTERMNT=/usr/local/poudriere/data/.m/head-powerpc64-default/ref
POUDRIERE_BUILD_TYPE=bulk
PACKAGE_BUILDING=yes
SAVED_TERM=screen
PWD=/usr/local/poudriere/data/.m/head-powerpc64-default/ref/.p/pool
P_PORTS_FEATURES=FLAVORS SELECTED_OPTIONS
MASTERNAME=head-powerpc64-default
SCRIPTPREFIX=/usr/local/share/poudriere
OLDPWD=/usr/local/poudriere/data/.m/head-powerpc64-default/ref/.p
SCRIPTPATH=/usr/local/share/poudriere/bulk.sh
POUDRIEREPATH=/usr/local/bin/poudriere
---End Environment---
---Begin Poudriere Port Flags/Env---
PORT_FLAGS=
PKGENV=
FLAVOR=
DEPENDS_ARGS=
MAKE_ARGS=
---End Poudriere Port Flags/Env---
---Begin OPTIONS List---
===> The following configuration options are available for firefox-esr-68.6.0_3,1:
CANBERRA=off: Sound theme alerts
DBUS=on: D-Bus IPC system support
DEBUG=off: Build with debugging support
FFMPEG=on: FFmpeg support (WMA, AIFF, AC3, APE...)
GCONF=on: GConf configuration backend support
LIBPROXY=off: Proxy support via libproxy
OPTIMIZED_CFLAGS=on: Use extra compiler optimizations
PROFILE=on: Build with profiling support
TEST=off: Build and/or run tests
====> Options available for the group AUDIO
ALSA=on: ALSA audio architecture support
JACK=on: JACK audio server support
PULSEAUDIO=on: PulseAudio sound server support
SNDIO=on: Sndio audio support
===> Use 'make config' to modify these settings
---End OPTIONS List---
--MAINTAINER--
gecko at FreeBSD.org
--End MAINTAINER--
--CONFIGURE_ARGS--
--End CONFIGURE_ARGS--
--CONFIGURE_ENV--
MAKE=gmake ac_cv_path_PERL=/usr/local/bin/perl ac_cv_path_PERL_PATH=/usr/local/bin/perl PERL_USE_UNSAFE_INC=1 PKG_CONFIG=pkgconf PYTHON="/usr/local/bin/python2.7" XDG_DATA_HOME=/wrkdirs/usr/ports/www/firefox-esr/work XDG_CONFIG_HOME=/wrkdirs/usr/ports/www/firefox-esr/work HOME=/wrkdirs/usr/ports/www/firefox-esr/work TMPDIR="/tmp" PATH=/wrkdirs/usr/ports/www/firefox-esr/work/.bin:/sbin:/bin:/usr/sbin:/usr/bin:/usr/local/sbin:/usr/local/bin:/root/bin SHELL=/bin/sh CONFIG_SHELL=/bin/sh CMAKE_PREFIX_PATH="/usr/local" LANG=en_US.UTF-8 LC_ALL=en_US.UTF-8
--End CONFIGURE_ENV--
--MAKE_ENV--
PERL_USE_UNSAFE_INC=1 XDG_DATA_HOME=/wrkdirs/usr/ports/www/firefox-esr/work XDG_CONFIG_HOME=/wrkdirs/usr/ports/www/firefox-esr/work HOME=/wrkdirs/usr/ports/www/firefox-esr/work TMPDIR="/tmp" PATH=/wrkdirs/usr/ports/www/firefox-esr/work/.bin:/sbin:/bin:/usr/sbin:/usr/bin:/usr/local/sbin:/usr/local/bin:/root/bin NO_PIE=yes MK_DEBUG_FILES=no MK_KERNEL_SYMBOLS=no SHELL=/bin/sh NO_LINT=YES LANG=en_US.UTF-8 LC_ALL=en_US.UTF-8 PREFIX=/usr/local LOCALBASE=/usr/local CC="/usr/local/bin/clang90" CFLAGS="-O2 -pipe -O3 -DLIBICONV_PLUG -fstack-protector-strong -isystem /usr/local/include -fno-strict-aliasing " CPP="/usr/local/bin/clang-cpp90" CPPFLAGS="-DLIBICONV_PLUG -isystem /usr/local/include" LDFLAGS=" -Wl,--as-needed -fstack-protector-strong " LIBS="-L/usr/local/lib" CXX="/usr/local/bin/clang++90" CXXFLAGS="-O2 -pipe -O3 -DLIBICONV_PLUG -fstack-protector-strong -isystem /usr/local/include -fno-strict-aliasing -DLIBICONV_PLUG -isystem /usr/local/include " MANPREFIX="/usr/local" BSD_
INSTALL_PROGRAM="install -m 555" BSD_INSTALL_LIB="install -m 0644" BSD_INSTALL_SCRIPT="install -m 555" BSD_INSTALL_DATA="install -m 0644" BSD_INSTALL_MAN="install -m 444"
--End MAKE_ENV--
--PLIST_SUB--
GTK2_VERSION="2.10.0" GTK3_VERSION="3.0.0" PYTHON_INCLUDEDIR=include/python2.7 PYTHON_LIBDIR=lib/python2.7 PYTHON_PLATFORM=freebsd13 PYTHON_SITELIBDIR=lib/python2.7/site-packages PYTHON_SUFFIX=27 PYTHON_VER=2.7 PYTHON_VERSION=python2.7 PYTHON2="" PYTHON3="@comment " OSREL=13.0 PREFIX=%D LOCALBASE=/usr/local RESETPREFIX=/usr/local LIB32DIR=lib PERL_VERSION=5.30.2 PERL_VER=5.30 PERL5_MAN1=lib/perl5/site_perl/man/man1 PERL5_MAN3=lib/perl5/site_perl/man/man3 SITE_PERL=lib/perl5/site_perl SITE_ARCH=lib/perl5/site_perl/mach/5.30 DOCSDIR="share/doc/firefox" EXAMPLESDIR="share/examples/firefox" DATADIR="share/firefox" WWWDIR="www/firefox" ETCDIR="etc/firefox"
--End PLIST_SUB--
--SUB_LIST--
PREFIX=/usr/local LOCALBASE=/usr/local DATADIR=/usr/local/share/firefox DOCSDIR=/usr/local/share/doc/firefox EXAMPLESDIR=/usr/local/share/examples/firefox WWWDIR=/usr/local/www/firefox ETCDIR=/usr/local/etc/firefox
--End SUB_LIST--
---Begin make.conf---
USE_PACKAGE_DEPENDS=yes
BATCH=yes
WRKDIRPREFIX=/wrkdirs
PORTSDIR=/usr/ports
PACKAGES=/packages
DISTDIR=/distfiles
PACKAGE_BUILDING=yes
PACKAGE_BUILDING_FLAVORS=yes
#### /usr/local/etc/poudriere.d/make.conf ####
# XXX: We really need this but cannot use it while 'make checksum' does not
# try the next mirror on checksum failure. It currently retries the same
# failed mirror and then fails rather then trying another. It *does*
# try the next if the size is mismatched though.
#MASTER_SITE_FREEBSD=yes
# Build ALLOW_MAKE_JOBS_PACKAGES with 2 jobs
MAKE_JOBS_NUMBER=4
#### /usr/ports/Mk/Scripts/ports_env.sh ####
_CCVERSION_921dbbb2=FreeBSD clang version 10.0.0 (git at github.com:llvm/llvm-project.git llvmorg-10.0.0-rc4-5-g52c365aa9ca) Target: powerpc64-unknown-freebsd13.0 Thread model: posix InstalledDir: /usr/bin
_ALTCCVERSION_921dbbb2=none
_CXXINTERNAL_acaad9ca=FreeBSD clang version 10.0.0 (git at github.com:llvm/llvm-project.git llvmorg-10.0.0-rc4-5-g52c365aa9ca) Target: powerpc64-unknown-freebsd13.0 Thread model: posix InstalledDir: /usr/bin "/usr/bin/ld" "--eh-frame-hdr" "-dynamic-linker" "/libexec/ld-elf.so.1" "--enable-new-dtags" "-o" "a.out" "/usr/lib/crt1.o" "/usr/lib/crti.o" "/usr/lib/crtbegin.o" "-L/usr/lib" "/dev/null" "-lc++" "-lm" "-lgcc" "--as-needed" "-lgcc_s" "--no-as-needed" "-lc" "-lgcc" "--as-needed" "-lgcc_s" "--no-as-needed" "/usr/lib/crtend.o" "/usr/lib/crtn.o"
CC_OUTPUT_921dbbb2_58173849=yes
CC_OUTPUT_921dbbb2_9bdba57c=yes
CC_OUTPUT_921dbbb2_6a4fe7f5=yes
CC_OUTPUT_921dbbb2_6bcac02b=yes
CC_OUTPUT_921dbbb2_67d20829=yes
CC_OUTPUT_921dbbb2_bfa62e83=yes
CC_OUTPUT_921dbbb2_f0b4d593=yes
CC_OUTPUT_921dbbb2_308abb44=yes
CC_OUTPUT_921dbbb2_f00456e5=yes
CC_OUTPUT_921dbbb2_65ad290d=yes
CC_OUTPUT_921dbbb2_f2776b26=yes
CC_OUTPUT_921dbbb2_b2657cc3=yes
CC_OUTPUT_921dbbb2_380987f7=yes
CC_OUTPUT_921dbbb2_160933ec=yes
CC_OUTPUT_921dbbb2_fb62803b=yes
_OBJC_CCVERSION_921dbbb2=FreeBSD clang version 10.0.0 (git at github.com:llvm/llvm-project.git llvmorg-10.0.0-rc4-5-g52c365aa9ca) Target: powerpc64-unknown-freebsd13.0 Thread model: posix InstalledDir: /usr/bin
_OBJC_ALTCCVERSION_921dbbb2=none
ARCH=powerpc64
PPC_ABI=ELFv2
OPSYS=FreeBSD
_OSRELEASE=13.0-CURRENT
OSREL=13.0
OSVERSION=1300085
PYTHONBASE=/usr/local
CONFIGURE_MAX_CMD_LEN=524288
HAVE_PORTS_ENV=1
#### Misc Poudriere ####
GID=0
UID=0
DISABLE_MAKE_JOBS=poudriere
---End make.conf---
--Resource limits--
cpu time (seconds, -t) unlimited
file size (512-blocks, -f) unlimited
data seg size (kbytes, -d) 33554432
stack size (kbytes, -s) 524288
core file size (512-blocks, -c) unlimited
max memory size (kbytes, -m) unlimited
locked memory (kbytes, -l) unlimited
max user processes (-u) 89999
open files (-n) 1024
virtual mem size (kbytes, -v) unlimited
swap limit (kbytes, -w) unlimited
socket buffer size (bytes, -b) unlimited
pseudo-terminals (-p) unlimited
kqueues (-k) unlimited
umtx shared locks (-o) unlimited
--End resource limits--
=======================<phase: check-sanity >============================
===========================================================================
=======================<phase: pkg-depends >============================
===> firefox-esr-68.6.0_3,1 depends on file: /usr/local/sbin/pkg - not found
===> Installing existing package /packages/All/pkg-1.13.2.txz
[head-powerpc64-default-job-13] Installing pkg-1.13.2...
[head-powerpc64-default-job-13] Extracting pkg-1.13.2: .......... done
===> firefox-esr-68.6.0_3,1 depends on file: /usr/local/sbin/pkg - found
===> Returning to build of firefox-esr-68.6.0_3,1
===========================================================================
=======================<phase: fetch-depends >============================
===========================================================================
=======================<phase: fetch >============================
===> Fetching all distfiles required by firefox-esr-68.6.0_3,1 for building
===========================================================================
=======================<phase: checksum >============================
===> Fetching all distfiles required by firefox-esr-68.6.0_3,1 for building
=> SHA256 Checksum OK for firefox-68.6.0esr.source.tar.xz.
===========================================================================
=======================<phase: extract-depends>============================
===========================================================================
=======================<phase: extract >============================
===> Fetching all distfiles required by firefox-esr-68.6.0_3,1 for building
===> Extracting for firefox-esr-68.6.0_3,1
=> SHA256 Checksum OK for firefox-68.6.0esr.source.tar.xz.
===========================================================================
=======================<phase: patch-depends >============================
===========================================================================
=======================<phase: patch >============================
===> Patching for firefox-esr-68.6.0_3,1
<snip>
--> gfx/wr/webrender/src/renderer.rs:2008:23
|
2008 | notifier: Box<RenderNotifier>,
| ^^^^^^^^^^^^^^ help: use `dyn`: `dyn RenderNotifier`
warning: trait objects without an explicit `dyn` are deprecated
--> gfx/wr/webrender/src/renderer.rs:2933:63
|
2933 | pub fn set_external_image_handler(&mut self, handler: Box<ExternalImageHandler>) {
| ^^^^^^^^^^^^^^^^^^^^ help: use `dyn`: `dyn ExternalImageHandler`
warning: trait objects without an explicit `dyn` are deprecated
--> gfx/wr/webrender/src/renderer.rs:2938:61
|
2938 | pub fn set_output_image_handler(&mut self, handler: Box<OutputImageHandler>) {
| ^^^^^^^^^^^^^^^^^^ help: use `dyn`: `dyn OutputImageHandler`
warning: trait objects without an explicit `dyn` are deprecated
--> gfx/wr/webrender/src/renderer.rs:5192:24
|
5192 | select_color: &Fn(&Texture) -> [f32; 4],
| ^^^^^^^^^^^^^^^^^^^^^^^^ help: use `dyn`: `dyn Fn(&Texture) -> [f32; 4]`
warning: trait objects without an explicit `dyn` are deprecated
--> gfx/wr/webrender/src/renderer.rs:5655:40
|
5655 | pub blob_image_handler: Option<Box<BlobImageHandler>>,
| ^^^^^^^^^^^^^^^^ help: use `dyn`: `dyn BlobImageHandler`
warning: trait objects without an explicit `dyn` are deprecated
--> gfx/wr/webrender/src/renderer.rs:5656:30
|
5656 | pub recorder: Option<Box<ApiRecordingReceiver>>,
| ^^^^^^^^^^^^^^^^^^^^ help: use `dyn`: `dyn ApiRecordingReceiver`
warning: trait objects without an explicit `dyn` are deprecated
--> gfx/wr/webrender/src/renderer.rs:5657:37
|
5657 | pub thread_listener: Option<Box<ThreadListener + Send + Sync>>,
| ^^^^^^^^^^^^^^^^^^^^^^^^^^^^ help: use `dyn`: `dyn ThreadListener + Send + Sync`
warning: trait objects without an explicit `dyn` are deprecated
--> gfx/wr/webrender/src/renderer.rs:5663:41
|
5663 | pub scene_builder_hooks: Option<Box<SceneBuilderHooks + Send>>,
| ^^^^^^^^^^^^^^^^^^^^^^^^ help: use `dyn`: `dyn SceneBuilderHooks + Send`
warning: trait objects without an explicit `dyn` are deprecated
--> gfx/wr/webrender/src/renderer.rs:5664:29
|
5664 | pub sampler: Option<Box<AsyncPropertySampler + Send>>,
| ^^^^^^^^^^^^^^^^^^^^^^^^^^^ help: use `dyn`: `dyn AsyncPropertySampler + Send`
warning: trait objects without an explicit `dyn` are deprecated
--> gfx/wr/webrender/src/renderer.rs:5764:70
|
5764 | fn new_debug_server(_enable: bool, api_tx: MsgSender<ApiMsg>) -> Box<DebugServer> {
| ^^^^^^^^^^^ help: use `dyn`: `dyn DebugServer`
warning: trait objects without an explicit `dyn` are deprecated
--> gfx/wr/webrender/src/resource_cache.rs:462:36
|
462 | blob_image_handler: Option<Box<BlobImageHandler>>,
| ^^^^^^^^^^^^^^^^ help: use `dyn`: `dyn BlobImageHandler`
warning: trait objects without an explicit `dyn` are deprecated
--> gfx/wr/webrender/src/resource_cache.rs:470:39
|
470 | blob_image_rasterizer: Option<Box<AsyncBlobImageRasterizer>>,
| ^^^^^^^^^^^^^^^^^^^^^^^^ help: use `dyn`: `dyn AsyncBlobImageRasterizer`
warning: trait objects without an explicit `dyn` are deprecated
--> gfx/wr/webrender/src/resource_cache.rs:489:40
|
489 | blob_image_handler: Option<Box<BlobImageHandler>>,
| ^^^^^^^^^^^^^^^^ help: use `dyn`: `dyn BlobImageHandler`
warning: trait objects without an explicit `dyn` are deprecated
--> gfx/wr/webrender/src/resource_cache.rs:686:36
|
686 | &mut self, rasterizer: Box<AsyncBlobImageRasterizer>,
| ^^^^^^^^^^^^^^^^^^^^^^^^ help: use `dyn`: `dyn AsyncBlobImageRasterizer`
warning: trait objects without an explicit `dyn` are deprecated
--> gfx/wr/webrender/src/resource_cache.rs:1161:23
|
1161 | ) -> (Option<(Box<AsyncBlobImageRasterizer>, AsyncBlobImageInfo)>, Vec<BlobImageParams>) {
| ^^^^^^^^^^^^^^^^^^^^^^^^ help: use `dyn`: `dyn AsyncBlobImageRasterizer`
warning: trait objects without an explicit `dyn` are deprecated
--> gfx/wr/webrender/src/scene_builder.rs:48:38
|
48 | pub blob_rasterizer: Option<(Box<AsyncBlobImageRasterizer>, AsyncBlobImageInfo)>,
| ^^^^^^^^^^^^^^^^^^^^^^^^ help: use `dyn`: `dyn AsyncBlobImageRasterizer`
warning: trait objects without an explicit `dyn` are deprecated
--> gfx/wr/webrender/src/scene_builder.rs:93:38
|
93 | pub blob_rasterizer: Option<(Box<AsyncBlobImageRasterizer>, AsyncBlobImageInfo)>,
| ^^^^^^^^^^^^^^^^^^^^^^^^ help: use `dyn`: `dyn AsyncBlobImageRasterizer`
warning: trait objects without an explicit `dyn` are deprecated
--> gfx/wr/webrender/src/scene_builder.rs:274:23
|
274 | hooks: Option<Box<SceneBuilderHooks + Send>>,
| ^^^^^^^^^^^^^^^^^^^^^^^^ help: use `dyn`: `dyn SceneBuilderHooks + Send`
warning: trait objects without an explicit `dyn` are deprecated
--> gfx/wr/webrender/src/scene_builder.rs:283:27
|
283 | hooks: Option<Box<SceneBuilderHooks + Send>>,
| ^^^^^^^^^^^^^^^^^^^^^^^^ help: use `dyn`: `dyn SceneBuilderHooks + Send`
warning: unnecessary parentheses around block return value
--> gfx/wr/webrender/src/shade.rs:822:9
|
822 | (buffer_kind as usize)
| ^^^^^^^^^^^^^^^^^^^^^^ help: remove these parentheses
|
= note: `#[warn(unused_parens)]` on by default
warning: `...` range patterns are deprecated
--> gfx/wr/webrender/src/texture_cache.rs:1769:10
|
1769 | 1...16 => 16,
| ^^^ help: use `..=` for an inclusive range
warning: `...` range patterns are deprecated
--> gfx/wr/webrender/src/texture_cache.rs:1770:11
|
1770 | 17...32 => 32,
| ^^^ help: use `..=` for an inclusive range
warning: `...` range patterns are deprecated
--> gfx/wr/webrender/src/texture_cache.rs:1771:11
|
1771 | 33...64 => 64,
| ^^^ help: use `..=` for an inclusive range
warning: `...` range patterns are deprecated
--> gfx/wr/webrender/src/texture_cache.rs:1772:11
|
1772 | 65...128 => 128,
| ^^^ help: use `..=` for an inclusive range
warning: `...` range patterns are deprecated
--> gfx/wr/webrender/src/texture_cache.rs:1773:12
|
1773 | 129...256 => 256,
| ^^^ help: use `..=` for an inclusive range
warning: `...` range patterns are deprecated
--> gfx/wr/webrender/src/texture_cache.rs:1774:12
|
1774 | 257...512 => 512,
| ^^^ help: use `..=` for an inclusive range
warning: use of deprecated item 'std::mem::uninitialized': use `mem::MaybeUninit` instead
--> gfx/wr/webrender/src/prim_store/gradient.rs:665:77
|
665 | let mut entries: [GradientDataEntry; GRADIENT_DATA_SIZE] = unsafe { mem::uninitialized() };
| ^^^^^^^^^^^^^^^^^^
warning: use of deprecated item 'std::mem::uninitialized': use `mem::MaybeUninit` instead
--> gfx/wr/webrender/src/renderer.rs:1468:32
|
1468 | data.push(unsafe { mem::uninitialized() });
| ^^^^^^^^^^^^^^^^^^
warning: use of deprecated item 'std::mem::uninitialized': use `mem::MaybeUninit` instead
--> gfx/wr/webrender/src/renderer.rs:1476:36
|
1476 | data.push(unsafe { mem::uninitialized() });
| ^^^^^^^^^^^^^^^^^^
warning: use of deprecated item 'std::mem::uninitialized': use `mem::MaybeUninit` instead
--> gfx/wr/webrender/src/platform/unix/font.rs:530:42
|
530 | let mut cbox: FT_BBox = unsafe { mem::uninitialized() };
| ^^^^^^^^^^^^^^^^^^
warning: use of deprecated item 'std::mem::uninitialized': use `mem::MaybeUninit` instead
--> gfx/wr/webrender/src/platform/unix/font.rs:713:37
|
713 | let mut cbox: FT_BBox = mem::uninitialized();
| ^^^^^^^^^^^^^^^^^^
error: build failed
gmake[4]: *** [/wrkdirs/usr/ports/www/firefox-esr/work/firefox-68.6.0/config/makefiles/rust.mk:240: force-cargo-library-build] Error 101
gmake[4]: Leaving directory '/wrkdirs/usr/ports/www/firefox-esr/work/.build/toolkit/library/rust'
gmake[3]: *** [/wrkdirs/usr/ports/www/firefox-esr/work/firefox-68.6.0/config/recurse.mk:74: toolkit/library/rust/target] Error 2
gmake[3]: Leaving directory '/wrkdirs/usr/ports/www/firefox-esr/work/.build'
gmake[2]: *** [/wrkdirs/usr/ports/www/firefox-esr/work/firefox-68.6.0/config/recurse.mk:34: compile] Error 2
gmake[2]: Leaving directory '/wrkdirs/usr/ports/www/firefox-esr/work/.build'
gmake[1]: *** [/wrkdirs/usr/ports/www/firefox-esr/work/firefox-68.6.0/config/rules.mk:413: all] Error 2
gmake[1]: Leaving directory '/wrkdirs/usr/ports/www/firefox-esr/work/.build'
*** Error code 1
Stop.
make: stopped in /usr/ports/www/firefox-esr
More information about the freebsd-pkg-fallout
mailing list