harfbuzz-icu, harfbuzz, webkit-gtk2, webkit2-gtk3, libreoffice, firefox

Burmeister, Robert Robert.Burmeister at utoledo.edu
Thu Sep 28 20:12:08 UTC 2017


FreeBSD 11.1 i386

Updating:
libreoffice-5.3.6_1          <  needs updating (port has 5.3.6_4)     (configure error)
webkit-gtk2-2.4.11_12    <  needs updating (port has 2.4.11_13)  (unknown build error)
webkit2-gtk3-2.16.6_1    <  needs updating (port has 2.16.6_2)    (unknown build error)

Root cause appears to related to sanity check failure for harfbuzz-icu 1.5.1_1

---------------------------------------------------------------------------------------------------------

checking for HARFBUZZ... yes
checking whether system Harfbuzz is built with Graphite support... checking for hb_graphite2_face_get_gr_face... no
configure: error: Harfbuzz needs to be built with Graphite support.
===>  Script "configure" failed unexpectedly.
Please report the problem to office at FreeBSD.org [maintainer] and attach the
"/tmp/usr/ports/editors/libreoffice/work/libreoffice-5.3.6.1/config.log"
including the output of the failure of your make command. Also, it might be
a good idea to provide an overview of all packages installed on your system
(e.g. a /usr/local/sbin/pkg-static info -g -Ea).
*** Error code 1

Stop.
make[1]: stopped in /usr/ports/editors/libreoffice
*** Error code 1

Stop.
make: stopped in /usr/ports/editors/libreoffice
** Command failed [exit code 1]: /usr/bin/script -qa /tmp/portupgrade20170928-17949-1u69e9v env UPGRADE_TOOL=portupgrade UPGRADE_PORT=libreoffice-5.3.6_1 UPGRADE_PORT_VER=5.3.6_1 make
** Fix the problem and try again.
** Listing the failed packages (-:ignored / *:skipped / !:failed)
	! editors/libreoffice (libreoffice-5.3.6_1)	(configure error)

---------------------------------------------------------------------------------------------------------

/usr/include/pthread.h:319: syntax error, unexpected ')', expecting identifier or '(' or '*' or ';' in '      int * _Nonnull restrict);' at ')'
/usr/include/stdio.h:128: syntax error, unexpected identifier, expecting ')' in ' int (* _Nullable _close)(void *);' at '_close'
/usr/include/stdio.h:129: syntax error, unexpected identifier, expecting ')' in ' int (* _Nullable _read)(void *, char *, int);' at '_read'
/usr/include/stdio.h:130: syntax error, unexpected identifier, expecting ')' in ' fpos_t (* _Nullable _seek)(void *, fpos_t, int);' at '_seek'
/usr/include/stdio.h:131: syntax error, unexpected identifier, expecting ')' in ' int (* _Nullable _write)(void *, const char *, int);' at '_write'
/usr/include/stdio.h:131: syntax error, unexpected ',', expecting identifier or '(' in ' int (* _Nullable _write)(void *, const char *, int);' at ','
/usr/include/stdio.h:155: syntax error, unexpected '}' in '};' at '}'
Source/WebKit/gtk/webkit/webkitversion.h:37: Warning: WebKit: symbol='WEBKITGTK_API_VERSION': Unknown namespace for symbol 'WEBKITGTK_API_VERSION'
/usr/bin/ld: warning: libicuuc.so.58, needed by /usr/local/lib/libharfbuzz-icu.so.0, not found (try using -rpath or -rpath-link)
/usr/bin/ld: warning: libicudata.so.58, needed by /usr/local/lib/libharfbuzz-icu.so.0, not found (try using -rpath or -rpath-link)
Shared object "libicuuc.so.58" not found, required by "libharfbuzz-icu.so.0"
Command '[u'/tmp/usr/ports/www/webkit-gtk2/work/webkitgtk-2.4.11/tmp-introspectXx3AeX/WebKit-1.0', u'--introspect-dump=/tmp/usr/ports/www/webkit-gtk2/work/webkitgtk-2.4.11/tmp-introspectXx3AeX/functions.txt,/tmp/usr/ports/www/webkit-gtk2/work/webkitgtk-2.4.11/tmp-introspectXx3AeX/dump.xml']' returned non-zero exit status 1
gmake[3]: *** [GNUmakefile:82601: WebKit-1.0.gir] Error 1
gmake[3]: Leaving directory '/tmp/usr/ports/www/webkit-gtk2/work/webkitgtk-2.4.11'
gmake[2]: *** [GNUmakefile:25837: all] Error 2
gmake[2]: Leaving directory '/tmp/usr/ports/www/webkit-gtk2/work/webkitgtk-2.4.11'
===> Compilation failed unexpectedly.
Try to set MAKE_JOBS_UNSAFE=yes and rebuild before reporting the failure to
the maintainer.
*** Error code 1

Stop.
make[1]: stopped in /usr/ports/www/webkit-gtk2
*** Error code 1

Stop.
make: stopped in /usr/ports/www/webkit-gtk2
** Command failed [exit code 1]: /usr/bin/script -qa /tmp/portupgrade20170928-12672-1j73r0 env UPGRADE_TOOL=portupgrade UPGRADE_PORT=webkit-gtk2-2.4.11_12 UPGRADE_PORT_VER=2.4.11_12 make
** Fix the problem and try again.
** Listing the failed packages (-:ignored / *:skipped / !:failed)
	! www/webkit-gtk2 (webkit-gtk2-2.4.11_12)	(unknown build error)

---------------------------------------------------------------------------------------------------------

/usr/include/pthread.h:319: syntax error, unexpected ')', expecting identifier or '(' or '*' or ';' in '      int * _Nonnull restrict);' at ')'
/usr/include/stdio.h:128: syntax error, unexpected identifier, expecting ')' in ' int (* _Nullable _close)(void *);' at '_close'
/usr/include/stdio.h:129: syntax error, unexpected identifier, expecting ')' in ' int (* _Nullable _read)(void *, char *, int);' at '_read'
/usr/include/stdio.h:130: syntax error, unexpected identifier, expecting ')' in ' fpos_t (* _Nullable _seek)(void *, fpos_t, int);' at '_seek'
/usr/include/stdio.h:131: syntax error, unexpected identifier, expecting ')' in ' int (* _Nullable _write)(void *, const char *, int);' at '_write'
/usr/include/stdio.h:131: syntax error, unexpected ',', expecting identifier or '(' in ' int (* _Nullable _write)(void *, const char *, int);' at ','
/usr/include/stdio.h:155: syntax error, unexpected '}' in '};' at '}'
/usr/bin/ld: warning: libicuuc.so.58, needed by /usr/local/lib/libharfbuzz-icu.so.0, not found (try using -rpath or -rpath-link)
/usr/bin/ld: warning: libicudata.so.58, needed by /usr/local/lib/libharfbuzz-icu.so.0, not found (try using -rpath or -rpath-link)
Shared object "libicuuc.so.58" not found, required by "libharfbuzz-icu.so.0"
Command '[u'/tmp/usr/ports/www/webkit2-gtk3/work/webkitgtk-2.16.6/Source/WebKit2/tmp-introspectmlS4Pg/WebKit2-4.0', u'--introspect-dump=/tmp/usr/ports/www/webkit2-gtk3/work/webkitgtk-2.16.6/Source/WebKit2/tmp-introspectmlS4Pg/functions.txt,/tmp/usr/ports/www/webkit2-gtk3/work/webkitgtk-2.16.6/Source/WebKit2/tmp-introspectmlS4Pg/dump.xml']' returned non-zero exit status 1
ninja: build stopped: subcommand failed.
===> Compilation failed unexpectedly.
Try to set MAKE_JOBS_UNSAFE=yes and rebuild before reporting the failure to
the maintainer.
*** Error code 1

Stop.
make[1]: stopped in /usr/ports/www/webkit2-gtk3
*** Error code 1

Stop.
make: stopped in /usr/ports/www/webkit2-gtk3
** Command failed [exit code 1]: /usr/bin/script -qa /tmp/portupgrade20170928-93858-1t7kcks env UPGRADE_TOOL=portupgrade UPGRADE_PORT=webkit2-gtk3-2.16.6_1 UPGRADE_PORT_VER=2.16.6_1 make
** Fix the problem and try again.
** Listing the failed packages (-:ignored / *:skipped / !:failed)
	! www/webkit2-gtk3 (webkit2-gtk3-2.16.6_1)	(unknown build error)


More information about the freebsd-gnome mailing list