another build problem

David Reid david at
Fri Apr 21 15:33:08 UTC 2006

Evince doesn't want to build...

In file included from djvu-document.c:21:
djvu-text.h:27: error: redefinition of typedef 'miniexp_t'
/usr/local/include/libdjvu/ddjvuapi.h:1184: error: previous declaration
of 'miniexp_t' was here
gmake[2]: *** [djvu-document.lo] Error 1
gmake[2]: Leaving directory

Again, amd64 on -CURRENT.

More information about the freebsd-gnome mailing list