GNOME 2.5 build failures
Adam Weinberger
adamw at magnesium.net
Thu Jan 22 03:05:34 PST 2004
Build of complete GNOME 2.5 on a fresh system fails in the following
places:
1) gedit-plugins (gnome2-power-tools)
checking for pkg-config... /usr/local/bin/pkg-config
checking for gedit-2.4 >= 2.3.5... gnome-config: not found
gnome-config: not found
Package gedit-2.4 was not found in the pkg-config search path.
Perhaps you should add the directory containing `gedit-2.4.pc'
to the PKG_CONFIG_PATH environment variable
No package 'gedit-2.4' found
fugu-adamw-current# pkg_info -L gedit2\* | grep '.pc$'
/usr/X11R6/libdata/pkgconfig/gedit-2.6.pc
Either gedit-plugins needs to be kludged to build against gedit-2.6 or
it needs to be removed from gnome2-power-tools/Makefile.
2) quick-lounge-applet (gnome2-power-tools)
cc -DHAVE_CONFIG_H -I. -I. -I.. -I.. -I.. -DPREFIX=\"/usr/X11R6\" -DSYSCONFDIR=\"/usr/X11R6/etc\" -DDATADIR=\"/usr/X11R6/share/gnome\" -DLIBDIR=\"/usr/X11R6/lib\" -DGNOME_ICONDIR=\"/usr/X11R6/share/gnome/pixmaps\" -DPIXMAPSDIR=\"/usr/X11R6/share/gnome/pixmaps\" -DGLADEDIR=\"/usr/X11R6/share/gnome/quick-lounge/glade\" -DG_DISABLE_DEPRECATED -DGDK_DISABLE_DEPRECATED -DGDK_PIXBUF_DISABLE_DEPRECATED -DGTK_DISABLE_DEPRECATED -DGNOME_VFS_DISABLE_DEPRECATED -DGNOME_DISABLE_DEPRECATED -DBONOBO_DISABLE_DEPRECATED -D_THREAD_SAFE -DORBIT2=1 -I/usr/local/include/glib-2.0 -I/usr/local/lib/glib-2.0/include -I/usr/local/include/atk-1.0 -I/usr/local/include/orbit-2.0 -I/usr/local/include/libbonobo-2.0 -I/usr/local/include/bonobo-activation-2.0 -I/usr/local/include/libart-2.0 -I/usr/local/include/libxml2 -I/usr/local/include -I/usr/X11R6/include/gtk-2.0 -I/usr/X11R6/lib/gtk-2.0/include -I/usr/X11R6/include -I/usr/X11R6/include/pango-1.0 -I/usr/local/include/freetype2 -I/usr/X11R6/include/libgnome-2.0 -I/usr/X11R6/include/gconf/2 -I/usr/X11R6/include/gnome-vfs-2.0 -I/usr/X11R6/lib/gnome-vfs-2.0/include -I/usr/X11R6/include/libgnomeui-2.0 -I/usr/X11R6/include/libgnomecanvas-2.0 -I/usr/X11R6/include/libbonoboui-2.0 -I/usr/X11R6/include/gnome-vfs-module-2.0 -I/usr/X11R6/include/gnome-desktop-2.0 -I/usr/X11R6/include/startup-notification-1.0 -I/usr/X11R6/include/libglade-2.0 -I/usr/X11R6/include/panel-2.0 -I/usr/local/include -O -pipe -mcpu=pentiumpro -MT dlg-pick-applications.lo -MD -MP -MF .deps/dlg-pick-applications.Tpo -c dlg-pick-applications.c -fPIC -DPIC -o .libs/dlg-pick-applications.lo
In file included from dlg-pick-applications.c:30:
/usr/X11R6/include/gnome-desktop-2.0/libgnome/gnome-desktop-item.h:216: error: syntax error before "GnomeIconTheme"
/usr/X11R6/include/gnome-desktop-2.0/libgnome/gnome-desktop-item.h:218: error: syntax error before '*' token
In file included from quick-box.h:30,
from quick-lounge.h:29,
from dlg-pick-applications.h:26,
from dlg-pick-applications.c:33:
quick-button.h:52: error: syntax error before "GnomeIconTheme"
quick-button.h:75: error: syntax error before "GnomeIconTheme"
In file included from quick-lounge.h:29,
from dlg-pick-applications.h:26,
from dlg-pick-applications.c:33:
quick-box.h:58: error: syntax error before "GnomeIconTheme"
In file included from dlg-pick-applications.h:26,
from dlg-pick-applications.c:33:
quick-lounge.h:45: error: syntax error before "GnomeIconTheme"
dlg-pick-applications.c: In function `add_applications':
dlg-pick-applications.c:233: error: structure has no member named `icon_theme'
dlg-pick-applications.c:291: error: structure has no member named `icon_theme'
gmake[2]: *** [dlg-pick-applications.lo] Error 1
gmake[2]: Leaving directory `/usr/ports/misc/quick-lounge-applet/work/quick-lounge-applet-2.0.2/src'
3) netspeed_applet (gnome2-power-tools)
gmake[2]: Entering directory `/usr/ports/net/netspeed_applet/work/netspeed_applet-0.9.1/src'
if cc -DHAVE_CONFIG_H -I. -I. -I.. -I.. -I/usr/X11R6/include -DORBIT2=1 -D_THREAD_SAFE -I/usr/local/include/libart-2.0 -I/usr/local/include/glib-2.0 -I/usr/local/lib/glib-2.0/include -I/usr/local/include/orbit-2.0 -I/usr/local/include/libbonobo-2.0 -I/usr/local/include/bonobo-activation-2.0 -I/usr/local/include/atk-1.0 -I/usr/local/include/libxml2 -I/usr/local/include -I/usr/X11R6/include/libgnomeui-2.0 -I/usr/X11R6/include/libgnome-2.0 -I/usr/X11R6/include/libgnomecanvas-2.0 -I/usr/X11R6/include/gtk-2.0 -I/usr/X11R6/include/gconf/2 -I/usr/X11R6/include/libbonoboui-2.0 -I/usr/X11R6/include/gnome-vfs-2.0 -I/usr/X11R6/lib/gnome-vfs-2.0/include -I/usr/X11R6/include/pango-1.0 -I/usr/X11R6/include -I/usr/local/include/freetype2 -I/usr/X11R6/lib/gtk-2.0/include -I/usr/X11R6/include/libgtop-2.0 -I/usr/X11R6/include/panel-2.0 -DGNOMELOCALEDIR=\""/usr/X11R6/share/locale"\" -DGNOME_DISABLE_DEPRECATED -DGTK_DISABLE_DEPRECATED -DGDK_DISABLE_DEPRECATED -DG_DISABLE_DEPRECATED -DDATADIR=\""/usr/X11R6/share/gnome/"\" -DPREFIX=\""/usr/X11R6/"\" -DLIBDIR=\""/usr/X11R6/lib/"\" -DSYSCONFDIR=\""/usr/X11R6/etc/"\" -I/usr/local/include -O -pipe -mcpu=pentiumpro -MT netspeed.o -MD -MP -MF ".deps/netspeed.Tpo" \
-c -o netspeed.o `test -f 'netspeed.c' || echo './'`netspeed.c; \
then mv -f ".deps/netspeed.Tpo" ".deps/netspeed.Po"; \
else rm -f ".deps/netspeed.Tpo"; exit 1; \
fi
netspeed.c: In function `settings_cb':
netspeed.c:1054: warning: assignment makes pointer from integer without a cast
netspeed.c:1056: error: invalid type argument of `->'
netspeed.c:1057: error: invalid type argument of `->'
netspeed.c:1136: error: invalid type argument of `->'
netspeed.c:1139: error: invalid type argument of `->'
netspeed.c:1142: error: invalid type argument of `->'
netspeed.c:1165: error: invalid type argument of `->'
netspeed.c: At top level:
netspeed.c:1180: error: syntax error before '*' token
netspeed.c: In function `incolor_changed_cb':
netspeed.c:1183: error: `data' undeclared (first use in this function)
netspeed.c:1183: error: (Each undeclared identifier is reported only once
netspeed.c:1183: error: for each function it appears in.)
netspeed.c:1186: error: `r' undeclared (first use in this function)
netspeed.c:1187: error: `g' undeclared (first use in this function)
netspeed.c:1188: error: `b' undeclared (first use in this function)
netspeed.c: At top level:
netspeed.c:1196: error: syntax error before '*' token
netspeed.c: In function `outcolor_changed_cb':
netspeed.c:1199: error: `data' undeclared (first use in this function)
netspeed.c:1202: error: `r' undeclared (first use in this function)
netspeed.c:1203: error: `g' undeclared (first use in this function)
netspeed.c:1204: error: `b' undeclared (first use in this function)
netspeed.c: In function `showinfo_cb':
netspeed.c:1269: warning: assignment makes pointer from integer without a cast
netspeed.c:1270: warning: assignment makes pointer from integer without a cast
gmake[2]: *** [netspeed.o] Error 1
gmake[2]: Leaving directory `/usr/ports/net/netspeed_applet/work/netspeed_applet-0.9.1/src'
--
Adam Weinberger
adam at vectors.cx // adamw at FreeBSD.org // adamw at magnesium.net
http://www.vectors.cx
More information about the freebsd-gnome
mailing list