cvs commit: ports/math/pgcalc Makefile distinfo pkg-plist

QA TIndy itetcu at FreeBSD.org
Mon Aug 18 07:05:40 UTC 2008


Hi,


The build which triggered this email is done under tinderbox-2.4.3, on 
7-STABLE on amd64, with tinderd_flags="-nullfs -plistcheck -onceonly"
and ccache support, with the "official" up-to-date Ports Tree, with the
following vars set:
NOPORTDOCS=yes,  NOPORTEXAMPLES=yes, NOPORTDATA=yes, FORCE_PACKAGE=yes.


Excerpt from http://t64.tecnik93.com/logs/7-STABLE-FTP/pgcalc2-2.2.10.log:


building pgcalc2-2.2.10 in directory /var/tinderbox/7-STABLE-FTP
maintained by: ports at FreeBSD.org
building for:  7.0-STABLE amd64
port directory: /usr/ports/math/pgcalc
Makefile ident: $FreeBSD: ports/math/pgcalc/Makefile,v 1.11 2008/08/17 14:17:53 mi Exp $
prefixes: LOCALBASE=usr/local X11BASE=usr/local
NO* env vars: NOPORTDOCS=yes NOPORTEXAMPLES=yes NOPORTDATA=yes
build started at Sun Aug 17 14:20:06 UTC 2008

.................................<Last 40 lines of the log>..................

gmake[3]: Nothing to be done for `install-exec-am'.
gmake[3]: Nothing to be done for `install-data-am'.
gmake[3]: Leaving directory `/work/a/ports/math/pgcalc/work/pgcalc2-2.2-10/doc'
gmake[2]: Leaving directory `/work/a/ports/math/pgcalc/work/pgcalc2-2.2-10/doc'
Making install in en
gmake[2]: Entering directory `/work/a/ports/math/pgcalc/work/pgcalc2-2.2-10/doc/en'
gmake[3]: Entering directory `/work/a/ports/math/pgcalc/work/pgcalc2-2.2-10/doc/en'
gmake[3]: Nothing to be done for `install-exec-am'.
/bin/sh ../../admin/mkinstalldirs /usr/local/share/doc/HTML/en/pgcalc
mkdir -p -- /usr/local/share/doc/HTML/en/pgcalc
install -o root -g wheel -m 444 index.docbook /usr/local/share/doc/HTML/en/pgcalc/index.docbook
/bin/sh ../../admin/mkinstalldirs /usr/local/share/doc/HTML/en/pgcalc
install -o root -g wheel -m 444 index.cache.bz2 /usr/local/share/doc/HTML/en/pgcalc/
rm -f /usr/local/share/doc/HTML/en/pgcalc/common
ln -s /usr/local/share/doc/HTML/en/common /usr/local/share/doc/HTML/en/pgcalc/common
gmake[3]: Leaving directory `/work/a/ports/math/pgcalc/work/pgcalc2-2.2-10/doc/en'
gmake[2]: Leaving directory `/work/a/ports/math/pgcalc/work/pgcalc2-2.2-10/doc/en'
gmake[1]: Leaving directory `/work/a/ports/math/pgcalc/work/pgcalc2-2.2-10/doc'
Making install in po
gmake[1]: Entering directory `/work/a/ports/math/pgcalc/work/pgcalc2-2.2-10/po'
gmake[2]: Entering directory `/work/a/ports/math/pgcalc/work/pgcalc2-2.2-10/po'
gmake[2]: Nothing to be done for `install-exec-am'.
gmake[2]: Nothing to be done for `install-data-am'.
gmake[2]: Leaving directory `/work/a/ports/math/pgcalc/work/pgcalc2-2.2-10/po'
gmake[1]: Leaving directory `/work/a/ports/math/pgcalc/work/pgcalc2-2.2-10/po'
Making install in src
gmake[1]: Entering directory `/work/a/ports/math/pgcalc/work/pgcalc2-2.2-10/src'
gmake[2]: Entering directory `/work/a/ports/math/pgcalc/work/pgcalc2-2.2-10/src'
test -z "/usr/local/bin" || ../admin/install-sh -c -d "/usr/local/bin"
../admin/install-sh: Permission denied
gmake[2]: *** [install-binPROGRAMS] Error 126
gmake[2]: Leaving directory `/work/a/ports/math/pgcalc/work/pgcalc2-2.2-10/src'
gmake[1]: *** [install-am] Error 2
gmake[1]: Leaving directory `/work/a/ports/math/pgcalc/work/pgcalc2-2.2-10/src'
gmake: *** [install-recursive] Error 1
*** Error code 2

Stop in /a/ports/math/pgcalc.
================================================================
build of /usr/ports/math/pgcalc ended at Sun Aug 17 14:23:51 UTC 2008


A description of the testing process can be found here:
http://T32.TecNik93.com/FreeBSD/QA-Tindy/testing_process.txt


Thanks for your work on making FreeBSD better,

-- 
IOnut - Un^d^dregistered ;) FreeBSD "user"
  "Intellectual Property" is   nowhere near as valuable   as "Intellect"
FreeBSD committer -> itetcu at FreeBSD.org, PGP Key ID 057E9F8B493A297B


More information about the cvs-all mailing list