[Bug 260078] security/gnutls fails to build
- Reply: bugzilla-noreply_a_freebsd.org: "[Bug 260078] security/gnutls fails to build"
- Reply: bugzilla-noreply_a_freebsd.org: "[Bug 260078] security/gnutls fails to build"
- Reply: bugzilla-noreply_a_freebsd.org: "[Bug 260078] security/gnutls fails to build"
- Reply: bugzilla-noreply_a_freebsd.org: "[Bug 260078] security/gnutls fails to build"
- Reply: bugzilla-noreply_a_freebsd.org: "[Bug 260078] security/gnutls fails to build"
- Reply: bugzilla-noreply_a_freebsd.org: "[Bug 260078] security/gnutls fails to build"
- Reply: bugzilla-noreply_a_freebsd.org: "[Bug 260078] security/gnutls fails to build"
- Reply: bugzilla-noreply_a_freebsd.org: "[Bug 260078] security/gnutls fails to build"
- Go to: [ bottom of page ] [ top of archives ] [ this month ]
Date: Sat, 27 Nov 2021 16:46:07 UTC
https://bugs.freebsd.org/bugzilla/show_bug.cgi?id=260078
Bug ID: 260078
Summary: security/gnutls fails to build
Product: Ports & Packages
Version: Latest
Hardware: arm64
OS: Any
Status: New
Severity: Affects Only Me
Priority: ---
Component: Individual Port(s)
Assignee: tijl@FreeBSD.org
Reporter: bz@FreeBSD.org
CC: toolchain@FreeBSD.org
Assignee: tijl@FreeBSD.org
Flags: maintainer-feedback?(tijl@FreeBSD.org)
This is on a clean main world from last night; gnutls being built as
dependency...
===> Building for gnutls-3.6.16
Making all in gl
Making all in .
Making all in tests
Making all in .
Making all in lib
Making all in includes
Making all in x509
Making all in auth
Making all in ext
Making all in algorithms
Making all in extras
Making all in accelerated
Making all in aarch64
libtool: compile: cc -Wa,-march=all -O2 -pipe -DLIBICONV_PLUG
-fstack-protector-strong -isystem /usr/local/include -fno-strict-aliasing -c
elf/sha1-armv8.s -fPIC -DPIC -o elf/.libs/sha1-armv8.o
PLEASE submit a bug report to https://bugs.freebsd.org/submit/ and include the
crash backtrace, preprocessed source, and associated run script.
Stack dump:
0. Program arguments: cc -Wa,-march=all -O2 -pipe -DLIBICONV_PLUG
-fstack-protector-strong -isystem /usr/local/include -fno-strict-aliasing -c
elf/sha1-armv8.s -fPIC -DPIC -o elf/.libs/sha1-armv8.o
1. Compilation construction
2. Building compilation jobs
3. Building compilation jobs
#0 0x00000000049e198c (/usr/bin/cc+0x49e198c)
#1 0x00000000049dfc8c (/usr/bin/cc+0x49dfc8c)
#2 0x00000000049e21b0 (/usr/bin/cc+0x49e21b0)
#3 0x00000000484060a0 (/lib/libthr.so.3+0x2a0a0)
Segmentation fault (core dumped)
gmake[9]: *** [Makefile:1775: elf/sha1-armv8.lo] Error 1
gmake[8]: *** [Makefile:1759: all-recursive] Error 1
gmake[7]: *** [Makefile:2372: all-recursive] Error 1
gmake[6]: *** [Makefile:1995: all] Error 2
gmake[5]: *** [Makefile:1765: all-recursive] Error 1
gmake[4]: *** [Makefile:1690: all] Error 2
*** Error code 1
Stop.
make[3]: stopped in /usr/ports/security/gnutls
*** Error code 1
--
You are receiving this mail because:
You are on the CC list for the bug.