[package - main-amd64-default][math/py-numpy] Failed for py310-numpy-1.16.6_2,1 in build

From: <pkg-fallout_at_FreeBSD.org>
Date: Sun, 22 Aug 2021 02:52:35 GMT
You are receiving this mail as a port that you maintain
is failing to build on the FreeBSD package build server.
Please investigate the failure and submit a PR to fix
build.

Maintainer:     python_at_FreeBSD.org
Log URL:        http://beefy18.nyi.freebsd.org/data/main-amd64-default/p957373794ec1_sefa485d5c3/logs/py310-numpy-1.16.6_2,1.log
Build URL:      http://beefy18.nyi.freebsd.org/build.html?mastername=main-amd64-default&build=p957373794ec1_sefa485d5c3
Log:

=>> Building math/py-numpy
build started at Sun Aug 22 02:51:01 UTC 2021
port directory: /usr/ports/math/py-numpy
package name: py310-numpy-1.16.6_2,1
building for: FreeBSD main-amd64-default-job-11 14.0-CURRENT FreeBSD 14.0-CURRENT 1400030 amd64
maintained by: python_at_FreeBSD.org
Makefile ident: 
Poudriere version: 3.2.8-21-g883afb07
Host OSVERSION: 1400008
Jail OSVERSION: 1400030
Job Id: 11




!!! Jail is newer than host. (Jail: 1400030, Host: 1400008) !!!
!!! This is not supported. !!!
!!! Host kernel must be same or newer than jail. !!!
!!! Expect build failures. !!!



---Begin Environment---
SHELL=/bin/csh
OSVERSION=1400030
UNAME_v=FreeBSD 14.0-CURRENT 1400030
UNAME_r=14.0-CURRENT
BLOCKSIZE=K
MAIL=/var/mail/root
MM_CHARSET=UTF-8
LANG=C.UTF-8
STATUS=1
HOME=/root
PATH=/sbin:/bin:/usr/sbin:/usr/bin:/usr/local/sbin:/usr/local/bin:/root/bin
LOCALBASE=/usr/local
USER=root
LIBEXECPREFIX=/usr/local/libexec/poudriere
POUDRIERE_VERSION=3.2.8-21-g883afb07
MASTERMNT=/usr/local/poudriere/data/.m/main-amd64-default/ref
POUDRIERE_BUILD_TYPE=bulk
PACKAGE_BUILDING=yes
SAVED_TERM=
PWD=/usr/local/poudriere/data/.m/main-amd64-default/ref/.p/pool
P_PORTS_FEATURES=FLAVORS SELECTED_OPTIONS
MASTERNAME=main-amd64-default
SCRIPTPREFIX=/usr/local/share/poudriere
OLDPWD=/usr/local/poudriere/data/.m/main-amd64-default/ref/.p
SCRIPTPATH=/usr/local/share/poudriere/bulk.sh
POUDRIEREPATH=/usr/local/bin/poudriere
---End Environment---

---Begin Poudriere Port Flags/Env---
PORT_FLAGS=
PKGENV=
FLAVOR=py310
DEPENDS_ARGS=
MAKE_ARGS= FLAVOR=py310
---End Poudriere Port Flags/Env---

---Begin OPTIONS List---
===> The following configuration options are available for py310-numpy-1.16.6_2,1:
     DOCS=on: Build and/or install documentation
     SUITESPARSE=on: Use AMD and UMFPACK in SuiteSparse
====> Options available for the single BLASLIB: you have to select exactly one of them
     ATLAS=off: ATLAS blas implementation
     NETLIB=off: Blas implementation from Netlib
     OPENBLAS=on: OpenBLAS blas implementation
===> Use 'make config' to modify these settings
---End OPTIONS List---

--MAINTAINER--
python_at_FreeBSD.org
--End MAINTAINER--

--CONFIGURE_ARGS--

--End CONFIGURE_ARGS--

--CONFIGURE_ENV--
F77="gfortran10" FC="gfortran10" FFLAGS="-O -Wl,-rpath=/usr/local/lib/gcc10" FCFLAGS="-Wl,-rpath=/usr/local/lib/gcc10" PYTHON="/usr/local/bin/python3.10" XDG_DATA_HOME=/wrkdirs/usr/ports/math/py-numpy/work-py310  XDG_CONFIG_HOME=/wrkdirs/usr/ports/math/py-numpy/work-py310  HOME=/wrkdirs/usr/ports/math/py-numpy/work-py310 TMPDIR="/tmp" PATH=/wrkdirs/usr/ports/math/py-numpy/work-py310/.bin:/sbin:/bin:/usr/sbin:/usr/bin:/usr/local/sbin:/usr/local/bin:/root/bin SHELL=/bin/sh CONFIG_SHELL=/bin/sh
--End CONFIGURE_ENV--

--MAKE_ENV--
F77="gfortran10" FC="gfortran10" FFLAGS="-O -Wl,-rpath=/usr/local/lib/gcc10" FCFLAGS="-Wl,-rpath=/usr/local/lib/gcc10" XDG_DATA_HOME=/wrkdirs/usr/ports/math/py-numpy/work-py310  XDG_CONFIG_HOME=/wrkdirs/usr/ports/math/py-numpy/work-py310  HOME=/wrkdirs/usr/ports/math/py-numpy/work-py310 TMPDIR="/tmp" PATH=/wrkdirs/usr/ports/math/py-numpy/work-py310/.bin:/sbin:/bin:/usr/sbin:/usr/bin:/usr/local/sbin:/usr/local/bin:/root/bin NO_PIE=yes MK_DEBUG_FILES=no MK_KERNEL_SYMBOLS=no SHELL=/bin/sh NO_LINT=YES ADDR2LINE="/usr/local/bin/addr2line" AR="/usr/local/bin/ar" AS="/usr/local/bin/as" CPPFILT="/usr/local/bin/c++filt" GPROF="/usr/local/bin/gprof" LD="/usr/local/bin/ld" NM="/usr/local/bin/nm" OBJCOPY="/usr/local/bin/objcopy" OBJDUMP="/usr/local/bin/objdump" RANLIB="/usr/local/bin/ranlib" READELF="/usr/local/bin/readelf" SIZE="/usr/local/bin/size" STRINGS="/usr/local/bin/strings" LDSHARED="cc -shared" PYTHONDONTWRITEBYTECODE= PYTHONOPTIMIZE= PREFIX=/usr/local  LOCALBASE=/usr/local  CC="cc" CF
 LAGS="-O2 -pipe  -fstack-protector-strong -fno-strict-aliasing "  CPP="cpp" CPPFLAGS=""  LDFLAGS=" -shared -Wl,-rpath=/usr/local/lib/gcc10  -L/usr/local/lib/gcc10 -B/usr/local/bin -L/usr/local/lib -fstack-protector-strong " LIBS=""  CXX="c++" CXXFLAGS="-O2 -pipe -fstack-protector-strong -fno-strict-aliasing  "  MANPREFIX="/usr/local" BSD_INSTALL_PROGRAM="install  -s -m 555"  BSD_INSTALL_LIB="install  -s -m 0644"  BSD_INSTALL_SCRIPT="install  -m 555"  BSD_INSTALL_DATA="install  -m 0644"  BSD_INSTALL_MAN="install  -m 444"
--End MAKE_ENV--

--PLIST_SUB--
PORTDOCS="" PYTHON_INCLUDEDIR=include/python3.10  PYTHON_LIBDIR=lib/python3.10  PYTHON_PLATFORM=freebsd14  PYTHON_SITELIBDIR=lib/python3.10/site-packages  PYTHON_SUFFIX=310  PYTHON_EXT_SUFFIX=.cpython-310  PYTHON_VER=3.10  PYTHON_VERSION=python3.10 PYTHON2="_at_comment " PYTHON3="" OSREL=14.0 PREFIX=%D LOCALBASE=/usr/local  RESETPREFIX=/usr/local LIB32DIR=lib DOCSDIR="share/doc/py310-numpy"  EXAMPLESDIR="share/examples/py310-numpy"  DATADIR="share/py310-numpy"  WWWDIR="www/py310-numpy"  ETCDIR="etc/py310-numpy"
--End PLIST_SUB--

--SUB_LIST--
PREFIX=/usr/local LOCALBASE=/usr/local  DATADIR=/usr/local/share/py310-numpy DOCSDIR=/usr/local/share/doc/py310-numpy EXAMPLESDIR=/usr/local/share/examples/py310-numpy  WWWDIR=/usr/local/www/py310-numpy ETCDIR=/usr/local/etc/py310-numpy
--End SUB_LIST--

---Begin make.conf---
USE_PACKAGE_DEPENDS=yes
BATCH=yes
WRKDIRPREFIX=/wrkdirs
PORTSDIR=/usr/ports
PACKAGES=/packages
DISTDIR=/distfiles
PACKAGE_BUILDING=yes
PACKAGE_BUILDING_FLAVORS=yes
#### /usr/local/etc/poudriere.d/make.conf ####
# XXX: We really need this but cannot use it while 'make checksum' does not
# try the next mirror on checksum failure.  It currently retries the same
# failed mirror and then fails rather then trying another.  It *does*
# try the next if the size is mismatched though.
#MASTER_SITE_FREEBSD=yes
# Build ALLOW_MAKE_JOBS_PACKAGES with 2 jobs
MAKE_JOBS_NUMBER=2
#### /usr/ports/Mk/Scripts/ports_env.sh ####
_CCVERSION_921dbbb2=FreeBSD clang version 12.0.1 (git_at_github.com:llvm/llvm-project.git llvmorg-12.0.1-0-gfed41342a82f) Target: x86_64-unknown-freebsd14.0 Thread model: posix InstalledDir: /usr/bin
_ALTCCVERSION_921dbbb2=none
_CXXINTERNAL_acaad9ca=FreeBSD clang version 12.0.1 (git_at_github.com:llvm/llvm-project.git llvmorg-12.0.1-0-gfed41342a82f) Target: x86_64-unknown-freebsd14.0 Thread model: posix InstalledDir: /usr/bin "/usr/bin/ld" "--eh-frame-hdr" "-dynamic-linker" "/libexec/ld-elf.so.1" "--hash-style=both" "--enable-new-dtags" "-o" "a.out" "/usr/lib/crt1.o" "/usr/lib/crti.o" "/usr/lib/crtbegin.o" "-L/usr/lib" "/dev/null" "-lc++" "-lm" "-lgcc" "--as-needed" "-lgcc_s" "--no-as-needed" "-lc" "-lgcc" "--as-needed" "-lgcc_s" "--no-as-needed" "/usr/lib/crtend.o" "/usr/lib/crtn.o"
CC_OUTPUT_921dbbb2_58173849=yes
CC_OUTPUT_921dbbb2_9bdba57c=yes
CC_OUTPUT_921dbbb2_6a4fe7f5=yes
CC_OUTPUT_921dbbb2_6bcac02b=yes
CC_OUTPUT_921dbbb2_67d20829=yes
CC_OUTPUT_921dbbb2_bfa62e83=yes
CC_OUTPUT_921dbbb2_f0b4d593=yes
CC_OUTPUT_921dbbb2_308abb44=yes
CC_OUTPUT_921dbbb2_f00456e5=yes
CC_OUTPUT_921dbbb2_65ad290d=yes
CC_OUTPUT_921dbbb2_f2776b26=yes
CC_OUTPUT_921dbbb2_b2657cc3=yes
CC_OUTPUT_921dbbb2_380987f7=yes
CC_OUTPUT_921dbbb2_160933ec=yes
CC_OUTPUT_921dbbb2_fb62803b=yes
_OBJC_CCVERSION_921dbbb2=FreeBSD clang version 12.0.1 (git_at_github.com:llvm/llvm-project.git llvmorg-12.0.1-0-gfed41342a82f) Target: x86_64-unknown-freebsd14.0 Thread model: posix InstalledDir: /usr/bin
_OBJC_ALTCCVERSION_921dbbb2=none
ARCH=amd64
OPSYS=FreeBSD
_OSRELEASE=14.0-CURRENT
OSREL=14.0
OSVERSION=1400030
PYTHONBASE=/usr/local
HAVE_COMPAT_IA32_KERN=YES
CONFIGURE_MAX_CMD_LEN=524288
HAVE_PORTS_ENV=1
#### Misc Poudriere ####
GID=0
UID=0
---End make.conf---
--Resource limits--
cpu time               (seconds, -t)  unlimited
file size           (512-blocks, -f)  unlimited
data seg size           (kbytes, -d)  33554432
stack size              (kbytes, -s)  524288
core file size      (512-blocks, -c)  unlimited
max memory size         (kbytes, -m)  unlimited
locked memory           (kbytes, -l)  unlimited
max user processes              (-u)  89999
open files                      (-n)  1024
virtual mem size        (kbytes, -v)  unlimited
swap limit              (kbytes, -w)  unlimited
socket buffer size       (bytes, -b)  unlimited
pseudo-terminals                (-p)  unlimited
kqueues                         (-k)  unlimited
umtx shared locks               (-o)  unlimited
--End resource limits--
=======================<phase: check-sanity   >============================
===>  License BSD3CLAUSE accepted by the user
===========================================================================
=======================<phase: pkg-depends    >============================
===>   py310-numpy-1.16.6_2,1 depends on file: /usr/local/sbin/pkg - not found
===>   Installing existing package /packages/All/pkg-1.17.1.pkg
[main-amd64-default-job-11] Installing pkg-1.17.1...
[main-amd64-default-job-11] Extracting pkg-1.17.1: .......... done
===>   py310-numpy-1.16.6_2,1 depends on file: /usr/local/sbin/pkg - found
===>   Returning to build of py310-numpy-1.16.6_2,1
===========================================================================
=======================<phase: fetch-depends  >============================
===========================================================================
=======================<phase: fetch          >============================
===>  License BSD3CLAUSE accepted by the user
===> Fetching all distfiles required by py310-numpy-1.16.6_2,1 for building
===========================================================================
=======================<phase: checksum       >============================
===>  License BSD3CLAUSE accepted by the user
===> Fetching all distfiles required by py310-numpy-1.16.6_2,1 for building
=> SHA256 Checksum OK for numpy-1.16.6.zip.
=> SHA256 Checksum OK for numpy-ref-1.16.1.pdf.
=> SHA256 Checksum OK for numpy-user-1.16.1.pdf.
===========================================================================
=======================<phase: extract-depends>============================
===========================================================================
=======================<phase: extract        >============================
===>  License BSD3CLAUSE accepted by the user
===> Fetching all distfiles required by py310-numpy-1.16.6_2,1 for building
===>  Extracting for py310-numpy-1.16.6_2,1
=> SHA256 Checksum OK for numpy-1.16.6.zip.
=> SHA256 Checksum OK for numpy-ref-1.16.1.pdf.
=> SHA256 Checksum OK for numpy-user-1.16.1.pdf.
===========================================================================
=======================<phase: patch-depends  >============================
===========================================================================
=======================<phase: patch          >============================
<snip>
Py_DEPRECATED(3.3) PyAPI_FUNC(PyObject*) PyUnicode_FromUnicode(
^
/usr/local/include/python3.10/pyport.h:513:54: note: expanded from macro 'Py_DEPRECATED'
#define Py_DEPRECATED(VERSION_UNUSED) __attribute__((__deprecated__))
                                                     ^
numpy/core/src/multiarray/scalartypes.c.src:1849:18: warning: 'PyUnicode_AsUnicode' is deprecated [-Wdeprecated-declarations]
        buffer = PyUnicode_AS_DATA(self);
                 ^
/usr/local/include/python3.10/cpython/unicodeobject.h:283:21: note: expanded from macro 'PyUnicode_AS_DATA'
    ((const char *)(PyUnicode_AS_UNICODE(op)))
                    ^
/usr/local/include/python3.10/cpython/unicodeobject.h:279:7: note: expanded from macro 'PyUnicode_AS_UNICODE'
      PyUnicode_AsUnicode(_PyObject_CAST(op)))
      ^
/usr/local/include/python3.10/cpython/unicodeobject.h:580:1: note: 'PyUnicode_AsUnicode' has been explicitly marked deprecated here
Py_DEPRECATED(3.3) PyAPI_FUNC(Py_UNICODE *) PyUnicode_AsUnicode(
^
/usr/local/include/python3.10/pyport.h:513:54: note: expanded from macro 'Py_DEPRECATED'
#define Py_DEPRECATED(VERSION_UNUSED) __attribute__((__deprecated__))
                                                     ^
numpy/core/src/multiarray/scalartypes.c.src:1850:18: warning: '_PyUnicode_get_wstr_length' is deprecated [-Wdeprecated-declarations]
        buflen = PyUnicode_GET_DATA_SIZE(self);
                 ^
/usr/local/include/python3.10/cpython/unicodeobject.h:268:6: note: expanded from macro 'PyUnicode_GET_DATA_SIZE'
    (PyUnicode_GET_SIZE(op) * Py_UNICODE_SIZE)
     ^
/usr/local/include/python3.10/cpython/unicodeobject.h:261:7: note: expanded from macro 'PyUnicode_GET_SIZE'
      PyUnicode_WSTR_LENGTH(op) :                    \
      ^
/usr/local/include/python3.10/cpython/unicodeobject.h:451:35: note: expanded from macro 'PyUnicode_WSTR_LENGTH'
#define PyUnicode_WSTR_LENGTH(op) _PyUnicode_get_wstr_length((PyObject*)op)
                                  ^
/usr/local/include/python3.10/cpython/unicodeobject.h:445:1: note: '_PyUnicode_get_wstr_length' has been explicitly marked deprecated here
Py_DEPRECATED(3.3)
^
/usr/local/include/python3.10/pyport.h:513:54: note: expanded from macro 'Py_DEPRECATED'
#define Py_DEPRECATED(VERSION_UNUSED) __attribute__((__deprecated__))
                                                     ^
numpy/core/src/multiarray/scalartypes.c.src:1850:18: warning: 'PyUnicode_AsUnicode' is deprecated [-Wdeprecated-declarations]
        buflen = PyUnicode_GET_DATA_SIZE(self);
                 ^
/usr/local/include/python3.10/cpython/unicodeobject.h:268:6: note: expanded from macro 'PyUnicode_GET_DATA_SIZE'
    (PyUnicode_GET_SIZE(op) * Py_UNICODE_SIZE)
     ^
/usr/local/include/python3.10/cpython/unicodeobject.h:262:14: note: expanded from macro 'PyUnicode_GET_SIZE'
      ((void)PyUnicode_AsUnicode(_PyObject_CAST(op)),\
             ^
/usr/local/include/python3.10/cpython/unicodeobject.h:580:1: note: 'PyUnicode_AsUnicode' has been explicitly marked deprecated here
Py_DEPRECATED(3.3) PyAPI_FUNC(Py_UNICODE *) PyUnicode_AsUnicode(
^
/usr/local/include/python3.10/pyport.h:513:54: note: expanded from macro 'Py_DEPRECATED'
#define Py_DEPRECATED(VERSION_UNUSED) __attribute__((__deprecated__))
                                                     ^
numpy/core/src/multiarray/scalartypes.c.src:1850:18: warning: '_PyUnicode_get_wstr_length' is deprecated [-Wdeprecated-declarations]
        buflen = PyUnicode_GET_DATA_SIZE(self);
                 ^
/usr/local/include/python3.10/cpython/unicodeobject.h:268:6: note: expanded from macro 'PyUnicode_GET_DATA_SIZE'
    (PyUnicode_GET_SIZE(op) * Py_UNICODE_SIZE)
     ^
/usr/local/include/python3.10/cpython/unicodeobject.h:264:8: note: expanded from macro 'PyUnicode_GET_SIZE'
       PyUnicode_WSTR_LENGTH(op)))
       ^
/usr/local/include/python3.10/cpython/unicodeobject.h:451:35: note: expanded from macro 'PyUnicode_WSTR_LENGTH'
#define PyUnicode_WSTR_LENGTH(op) _PyUnicode_get_wstr_length((PyObject*)op)
                                  ^
/usr/local/include/python3.10/cpython/unicodeobject.h:445:1: note: '_PyUnicode_get_wstr_length' has been explicitly marked deprecated here
Py_DEPRECATED(3.3)
^
/usr/local/include/python3.10/pyport.h:513:54: note: expanded from macro 'Py_DEPRECATED'
#define Py_DEPRECATED(VERSION_UNUSED) __attribute__((__deprecated__))
                                                     ^
numpy/core/src/multiarray/scalartypes.c.src:3214:71: error: too few arguments to function call, expected 2, have 1
    return _Py_HashDouble((double) ((PyFloatScalarObject *)obj)->obval);
           ~~~~~~~~~~~~~~                                             ^
/usr/local/include/python3.10/pyhash.h:10:23: note: '_Py_HashDouble' declared here
PyAPI_FUNC(Py_hash_t) _Py_HashDouble(PyObject *, double);
                      ^
numpy/core/src/multiarray/scalartypes.c.src:3223:56: error: too few arguments to function call, expected 2, have 1
            (((PyCFloatScalarObject *)obj)->obval).real);
                                                       ^
/usr/local/include/python3.10/pyhash.h:10:23: note: '_Py_HashDouble' declared here
PyAPI_FUNC(Py_hash_t) _Py_HashDouble(PyObject *, double);
                      ^
numpy/core/src/multiarray/scalartypes.c.src:3229:56: error: too few arguments to function call, expected 2, have 1
            (((PyCFloatScalarObject *)obj)->obval).imag);
                                                       ^
/usr/local/include/python3.10/pyhash.h:10:23: note: '_Py_HashDouble' declared here
PyAPI_FUNC(Py_hash_t) _Py_HashDouble(PyObject *, double);
                      ^
numpy/core/src/multiarray/scalartypes.c.src:3214:76: error: too few arguments to function call, expected 2, have 1
    return _Py_HashDouble((double) ((PyLongDoubleScalarObject *)obj)->obval);
           ~~~~~~~~~~~~~~                                                  ^
/usr/local/include/python3.10/pyhash.h:10:23: note: '_Py_HashDouble' declared here
PyAPI_FUNC(Py_hash_t) _Py_HashDouble(PyObject *, double);
                      ^
numpy/core/src/multiarray/scalartypes.c.src:3223:61: error: too few arguments to function call, expected 2, have 1
            (((PyCLongDoubleScalarObject *)obj)->obval).real);
                                                            ^
/usr/local/include/python3.10/pyhash.h:10:23: note: '_Py_HashDouble' declared here
PyAPI_FUNC(Py_hash_t) _Py_HashDouble(PyObject *, double);
                      ^
numpy/core/src/multiarray/scalartypes.c.src:3229:61: error: too few arguments to function call, expected 2, have 1
            (((PyCLongDoubleScalarObject *)obj)->obval).imag);
                                                            ^
/usr/local/include/python3.10/pyhash.h:10:23: note: '_Py_HashDouble' declared here
PyAPI_FUNC(Py_hash_t) _Py_HashDouble(PyObject *, double);
                      ^
numpy/core/src/multiarray/scalartypes.c.src:3244:81: error: too few arguments to function call, expected 2, have 1
    return _Py_HashDouble(npy_half_to_double(((PyHalfScalarObject *)obj)->obval));
           ~~~~~~~~~~~~~~                                                       ^
/usr/local/include/python3.10/pyhash.h:10:23: note: '_Py_HashDouble' declared here
PyAPI_FUNC(Py_hash_t) _Py_HashDouble(PyObject *, double);
                      ^
14 warnings and 7 errors generated.
cc: numpy/core/src/multiarray/temp_elide.c
cc: numpy/core/src/multiarray/vdot.c
cc: numpy/core/src/multiarray/nditer_pywrap.c
cc: numpy/core/src/multiarray/typeinfo.c
cc: build/src.freebsd-14.0-CURRENT-amd64-3.1/numpy/core/src/umath/loops.c
cc: numpy/core/src/umath/umathmodule.c
cc: numpy/core/src/multiarray/usertypes.c
cc: build/src.freebsd-14.0-CURRENT-amd64-3.1/numpy/core/src/multiarray/nditer_templ.c
cc: numpy/core/src/umath/reduction.c
cc: numpy/core/src/umath/extobj.c
cc: numpy/core/src/umath/ufunc_type_resolution.c
cc: numpy/core/src/multiarray/number.c
cc: numpy/core/src/umath/cpuid.c
cc: build/src.freebsd-14.0-CURRENT-amd64-3.1/numpy/core/src/umath/scalarmath.c
numpy/core/src/umath/loops.c.src:655:18: warning: 'PyEval_CallObjectWithKeywords' is deprecated [-Wdeprecated-declarations]
        result = PyEval_CallObject(tocall, arglist);
                 ^
/usr/local/include/python3.10/ceval.h:24:5: note: expanded from macro 'PyEval_CallObject'
    PyEval_CallObjectWithKeywords(callable, arg, (PyObject *)NULL)
    ^
/usr/local/include/python3.10/ceval.h:17:1: note: 'PyEval_CallObjectWithKeywords' has been explicitly marked deprecated here
Py_DEPRECATED(3.9) PyAPI_FUNC(PyObject *) PyEval_CallObjectWithKeywords(
^
/usr/local/include/python3.10/pyport.h:513:54: note: expanded from macro 'Py_DEPRECATED'
#define Py_DEPRECATED(VERSION_UNUSED) __attribute__((__deprecated__))
                                                     ^
cc: build/src.freebsd-14.0-CURRENT-amd64-3.1/numpy/core/src/npymath/ieee754.c
cc: numpy/core/src/umath/override.c
cc: build/src.freebsd-14.0-CURRENT-amd64-3.1/numpy/core/src/npymath/npy_math_complex.c
cc: numpy/core/src/multiarray/flagsobject.c
cc: numpy/core/src/npymath/npy_math.c
cc: numpy/core/src/multiarray/getset.c
cc: numpy/core/src/common/array_assign.c
cc: numpy/core/src/npymath/halffloat.c
cc: numpy/core/src/common/mem_overlap.c
cc: numpy/core/src/common/ucsnarrow.c
numpy/core/src/common/ucsnarrow.c:139:34: warning: 'PyUnicode_FromUnicode' is deprecated [-Wdeprecated-declarations]
        ret = (PyUnicodeObject *)PyUnicode_FromUnicode((Py_UNICODE*)buf,
                                 ^
/usr/local/include/python3.10/cpython/unicodeobject.h:551:1: note: 'PyUnicode_FromUnicode' has been explicitly marked deprecated here
Py_DEPRECATED(3.3) PyAPI_FUNC(PyObject*) PyUnicode_FromUnicode(
^
/usr/local/include/python3.10/pyport.h:513:54: note: expanded from macro 'Py_DEPRECATED'
#define Py_DEPRECATED(VERSION_UNUSED) __attribute__((__deprecated__))
                                                     ^
1 warning generated.
cc: numpy/core/src/common/ufunc_override.c
cc: numpy/core/src/common/numpyos.c
cc: numpy/core/src/multiarray/nditer_api.c
cc: numpy/core/src/common/npy_longdouble.c
numpy/core/src/umath/loops.c.src:2583:22: warning: code will never be executed [-Wunreachable-code]
        npy_intp n = dimensions[0];
                     ^~~~~~~~~~
numpy/core/src/umath/loops.c.src:2582:29: note: silence by adding parentheses to mark code as explicitly dead
    if (IS_BINARY_REDUCE && 0) {
                            ^
                            /* DISABLES CODE */ ( )
numpy/core/src/umath/loops.c.src:2583:22: warning: code will never be executed [-Wunreachable-code]
        npy_intp n = dimensions[0];
                     ^~~~~~~~~~
numpy/core/src/umath/loops.c.src:2582:29: note: silence by adding parentheses to mark code as explicitly dead
    if (IS_BINARY_REDUCE && 0) {
                            ^
                            /* DISABLES CODE */ ( )
numpy/core/src/umath/loops.c.src:2583:22: warning: code will never be executed [-Wunreachable-code]
        npy_intp n = dimensions[0];
                     ^~~~~~~~~~
numpy/core/src/umath/loops.c.src:2582:29: note: silence by adding parentheses to mark code as explicitly dead
    if (IS_BINARY_REDUCE && 0) {
                            ^
                            /* DISABLES CODE */ ( )
4 warnings generated.
cc: numpy/core/src/multiarray/mapping.c
cc: numpy/core/src/multiarray/methods.c
4 warnings generated.
cc: build/src.freebsd-14.0-CURRENT-amd64-3.1/numpy/core/src/umath/matmul.c
cc: numpy/core/src/umath/ufunc_object.c
numpy/core/src/umath/ufunc_object.c:657:19: warning: comparison of integers of different signs: 'int' and 'size_t' (aka 'unsigned long') [-Wsign-compare]
    for (i = 0; i < len; i++) {
                ~ ^ ~~~
1 warning generated.
error: Command "cc -Wno-unused-result -Wsign-compare -Wunreachable-code -DNDEBUG -O2 -pipe -fstack-protector-strong -fno-strict-aliasing -O2 -pipe -fstack-protector-strong -fno-strict-aliasing -fPIC -DNPY_INTERNAL_BUILD=1 -DHAVE_NPY_CONFIG_H=1 -D_FILE_OFFSET_BITS=64 -D_LARGEFILE_SOURCE=1 -D_LARGEFILE64_SOURCE=1 -Ibuild/src.freebsd-14.0-CURRENT-amd64-3.1/numpy/core/src/umath -Ibuild/src.freebsd-14.0-CURRENT-amd64-3.1/numpy/core/src/npymath -Ibuild/src.freebsd-14.0-CURRENT-amd64-3.1/numpy/core/src/common -Inumpy/core/include -Ibuild/src.freebsd-14.0-CURRENT-amd64-3.1/numpy/core/include/numpy -Inumpy/core/src/common -Inumpy/core/src -Inumpy/core -Inumpy/core/src/npymath -Inumpy/core/src/multiarray -Inumpy/core/src/umath -Inumpy/core/src/npysort -I/usr/local/include/python3.10 -Ibuild/src.freebsd-14.0-CURRENT-amd64-3.1/numpy/core/src/common -Ibuild/src.freebsd-14.0-CURRENT-amd64-3.1/numpy/core/src/npymath -Ibuild/src.freebsd-14.0-CURRENT-amd64-3.1/numpy/core/src/common -Ibuild/src.freebs
 d-14.0-CURRENT-amd64-3.1/numpy/core/src/npymath -c build/src.freebsd-14.0-CURRENT-amd64-3.1/numpy/core/src/multiarray/scalartypes.c -o build/temp.freebsd-14.0-CURRENT-amd64-3.10/build/src.freebsd-14.0-CURRENT-amd64-3.1/numpy/core/src/multiarray/scalartypes.o -MMD -MF build/temp.freebsd-14.0-CURRENT-amd64-3.10/build/src.freebsd-14.0-CURRENT-amd64-3.1/numpy/core/src/multiarray/scalartypes.o.d" failed with exit status 1
*** Error code 1

Stop.
make: stopped in /usr/ports/math/py-numpy
Received on Sun Aug 22 2021 - 02:52:35 UTC

Original text of this message