[Bug 274089] devel/gamin: fix build with lld 17
- In reply to: bugzilla-noreply_a_freebsd.org: "[Bug 274089] devel/gamin: fix build with lld 17"
- Go to: [ bottom of page ] [ top of archives ] [ this month ]
Date: Fri, 06 Oct 2023 17:52:07 UTC
https://bugs.freebsd.org/bugzilla/show_bug.cgi?id=274089
--- Comment #3 from commit-hook@FreeBSD.org ---
A commit in branch main references this bug:
URL:
https://cgit.FreeBSD.org/ports/commit/?id=9b934eb81abe3155ced3ea0a592b6256169ea595
commit 9b934eb81abe3155ced3ea0a592b6256169ea595
Author: Dimitry Andric <dim@FreeBSD.org>
AuthorDate: 2023-09-25 19:19:43 +0000
Commit: Dimitry Andric <dim@FreeBSD.org>
CommitDate: 2023-10-06 17:48:53 +0000
devel/gamin: fix build with lld 17
Building devel/gamin with lld 17 results in the following link error:
cc -shared .libs/gam_api.o .libs/gam_data.o .libs/gam_fork.o
.libs/gam_error.o .libs/gam_event.o -lpthread -L/usr/local/lib
-fstack-protector-strong -Wl,--version-script=./gamin_sym.version
-fstack-protector-strong -Wl,-soname -Wl,libfam.so.0 -o .libs/libfam.so.0.0.0
ld: error: version script assignment of 'global' to symbol
'FAMDebugLevel' failed: symbol not defined
ld: error: version script assignment of 'global' to symbol 'FAMDebug'
failed: symbol not defined
cc: error: linker command failed with exit code 1 (use -v to see
invocation)
This is because the FAMDebugLevel and FAMDebug symbols are only defined
when gamin is configured with --enable-debug, which we have no option
for in the port.
So fix it by removing the undefined symbols from the linker version
script.
PR: 274089
MFH: 2023Q4
devel/gamin/files/patch-libgamin_gamin__sym.version (new) | 11 +++++++++++
1 file changed, 11 insertions(+)
--
You are receiving this mail because:
You are the assignee for the bug.