[Bug 259454] /usr/ports/www/node port doesn't compile
- Go to: [ bottom of page ] [ top of archives ] [ this month ]
Date: Tue, 26 Oct 2021 06:54:12 UTC
https://bugs.freebsd.org/bugzilla/show_bug.cgi?id=259454
Bug ID: 259454
Summary: /usr/ports/www/node port doesn't compile
Product: Ports & Packages
Version: Latest
Hardware: i386
OS: Any
Status: New
Severity: Affects Some People
Priority: ---
Component: Individual Port(s)
Assignee: bhughes@freebsd.org
Reporter: bedreddinsahbaz@gmail.com
Assignee: bhughes@freebsd.org
Flags: maintainer-feedback?(bhughes@freebsd.org)
I can't install www/node port. Error message;
ld: error: undefined symbol: __atomic_is_lock_free
>>> referenced by threads_pthread.c
>>> threads_pthread:(CRYPTO_atomic_or) in archive /usr/ports/www/node/work/node-v17.0.0/out/Release/obj.target/deps/openssl/libopenssl.a
>>> referenced by threads_pthread.c
>>> threads_pthread:(CRYPTO_atomic_load) in archive /usr/ports/www/node/work/node-v17.0.0/out/Release/obj.target/deps/openssl/libopenssl.a
c++: error: linker command failed with exit code 1 (use -v to see invocation)
gmake[3]: *** [deps/openssl/openssl-cli.target.mk:258:
/usr/ports/www/node/work/node-v17.0.0/out/Release/openssl-cli] Error 1
gmake[3]: *** Waiting for unfinished jobs....
rm 45ea5d9210d9659c03236a4207678eddae27dc3a.intermediate
gmake[2]: *** [Makefile:110: node] Error 2
gmake[2]: Leaving directory '/usr/ports/www/node/work/node-v17.0.0'
===> Compilation failed unexpectedly.
Try to set MAKE_JOBS_UNSAFE=yes and rebuild before reporting the failure to
the maintainer.
*** Error code 1
Stop.
make[1]: stopped in /usr/ports/www/node
*** Error code 1
Stop.
make: stopped in /usr/ports/www/node
# uname -a
FreeBSD baki.xxxxxxxxxx.web.tr 12.2-RELEASE-p7 FreeBSD 12.2-RELEASE-p7 GENERIC
i386
Thank you..
--
You are receiving this mail because:
You are the assignee for the bug.