[package - 150amd64-default][lang/dotnet] Failed for dotnet-9.0.14 in build
- Go to: [ bottom of page ] [ top of archives ] [ this month ]
Date: Sun, 20 Sep 2026 08:51:39 UTC
You are receiving this mail as a port that you maintain
is failing to build on the FreeBSD package build server.
Please investigate the failure and submit a PR to fix
build.
Maintainer: arrowd@FreeBSD.org
Log URL: https://pkg-status.freebsd.org/beefy23/data/150amd64-default/e70f12310b37/logs/dotnet-9.0.14.log
Build URL: https://pkg-status.freebsd.org/beefy23/build.html?mastername=150amd64-default&build=e70f12310b37
Log:
=>> Building lang/dotnet
build started at Sun Sep 20 07:20:16 UTC 2026
port directory: /usr/ports/lang/dotnet
package name: dotnet-9.0.14
building for: FreeBSD 150amd64-default-job-17 15.0-RELEASE-p13 FreeBSD 15.0-RELEASE-p13 amd64
maintained by: arrowd@FreeBSD.org
Makefile datestamp: -rw-r--r-- 1 root wheel 6142 May 9 01:01 /usr/ports/lang/dotnet/Makefile
Ports top last git commit: e70f12310b37404f043f704c36cba9b2da0c6f35
Ports top unclean checkout: no
Port dir last git commit: 2a7c0561200c6cf9d0c0252cd4a7ab446eca8e4a
Port dir unclean checkout: no
Poudriere version: poudriere-git-3.4.8-3-gd92fb7c0
Host OSVERSION: 1600022
Jail OSVERSION: 1500068
Job Id: 17
---Begin Environment---
SHELL=/bin/sh
OSVERSION=1500068
UNAME_v=FreeBSD 15.0-RELEASE-p13
UNAME_r=15.0-RELEASE-p13
BLOCKSIZE=K
MAIL=/var/mail/root
MM_CHARSET=UTF-8
LANG=C.UTF-8
STATUS=1
HOME=/root
PATH=/sbin:/bin:/usr/sbin:/usr/bin:/usr/local/sbin:/usr/local/bin:/root/bin
MAKE_OBJDIR_CHECK_WRITABLE=0
LOCALBASE=/usr/local
USER=root
POUDRIERE_NAME=poudriere-git
LIBEXECPREFIX=/usr/local/libexec/poudriere
POUDRIERE_VERSION=3.4.8-3-gd92fb7c0
MASTERMNT=/usr/local/poudriere/data/.m/150amd64-default/ref
LC_COLLATE=C
POUDRIERE_BUILD_TYPE=bulk
PACKAGE_BUILDING=yes
SAVED_TERM=
OUTPUT_REDIRECTED_STDERR=4
OUTPUT_REDIRECTED=1
PWD=/usr/local/poudriere/data/.m/150amd64-default/17/.p
OUTPUT_REDIRECTED_STDOUT=3
P_PORTS_FEATURES=FLAVORS SUBPACKAGES SELECTED_OPTIONS
MASTERNAME=150amd64-default
SCRIPTPREFIX=/usr/local/share/poudriere
SCRIPTNAME=bulk.sh
OLDPWD=/usr/local/poudriere/data/.m/150amd64-default/ref/.p/pool
POUDRIERE_PKGNAME=poudriere-git-3.4.8-3-gd92fb7c0
SCRIPTPATH=/usr/local/share/poudriere/bulk.sh
POUDRIEREPATH=/usr/local/bin/poudriere
---End Environment---
---Begin Poudriere Port Flags/Env---
PORT_FLAGS=
PKGENV=
FLAVOR=
MAKE_ARGS=
---End Poudriere Port Flags/Env---
---Begin OPTIONS List---
---End OPTIONS List---
--MAINTAINER--
arrowd@FreeBSD.org
--End MAINTAINER--
--CONFIGURE_ARGS--
--End CONFIGURE_ARGS--
--CONFIGURE_ENV--
PKG_CONFIG=pkgconf PYTHON="/usr/local/bin/python3.12" XDG_DATA_HOME=/wrkdirs/usr/ports/lang/dotnet/work XDG_CONFIG_HOME=/wrkdirs/usr/ports/lang/dotnet/work XDG_CACHE_HOME=/wrkdirs/usr/ports/lang/dotnet/work/.cache HOME=/wrkdirs/usr/ports/lang/dotnet/work TMPDIR="/tmp" PATH=/wrkdirs/usr/ports/lang/dotnet/work/.bin:/sbin:/bin:/usr/sbin:/usr/bin:/usr/local/sbin:/usr/local/bin:/root/bin PKG_CONFIG_LIBDIR=/wrkdirs/usr/ports/lang/dotnet/work/.pkgconfig:/usr/local/libdata/pkgconfig:/usr/local/share/pkgconfig:/usr/libdata/pkgconfig SHELL=/bin/sh CONFIG_SHELL=/bin/sh DEFAULT_AUTOCONF=2.73
--End CONFIGURE_ENV--
--MAKE_ENV--
OPENSSLBASE=/usr OPENSSLDIR=/etc/ssl OPENSSLINC=/usr/include OPENSSLLIB=/usr/lib XDG_DATA_HOME=/wrkdirs/usr/ports/lang/dotnet/work XDG_CONFIG_HOME=/wrkdirs/usr/ports/lang/dotnet/work XDG_CACHE_HOME=/wrkdirs/usr/ports/lang/dotnet/work/.cache HOME=/wrkdirs/usr/ports/lang/dotnet/work TMPDIR="/tmp" PATH=/wrkdirs/usr/ports/lang/dotnet/work/.bin:/sbin:/bin:/usr/sbin:/usr/bin:/usr/local/sbin:/usr/local/bin:/root/bin PKG_CONFIG_LIBDIR=/wrkdirs/usr/ports/lang/dotnet/work/.pkgconfig:/usr/local/libdata/pkgconfig:/usr/local/share/pkgconfig:/usr/libdata/pkgconfig MK_DEBUG_FILES=no MK_KERNEL_SYMBOLS=no SHELL=/bin/sh NO_LINT=YES DEFAULT_AUTOCONF=2.73 PREFIX=/usr/local LOCALBASE=/usr/local CC="cc" CFLAGS="-O2 -pipe -fstack-protector-strong -fno-strict-aliasing " CPP="cpp" CPPFLAGS="" LDFLAGS=" -Wl,-rpath,/usr/local/lib:/usr/lib " LIBS="" CXX="c++" CXXFLAGS="-O2 -pipe -fstack-protector-strong -fno-strict-aliasing " BSD_INSTALL_PROGRAM="install -s -m 555" BSD_INSTALL_LIB="instal
l -s -m 0644" BSD_INSTALL_SCRIPT="install -m 555" BSD_INSTALL_DATA="install -m 0644" BSD_INSTALL_MAN="install -m 444"
--End MAKE_ENV--
--PLIST_SUB--
DOTNET_ARCH=x64 FULL_DOTNETVERSION=9.0.14 DOTNETVERSION=9.0 SDKVERSION=9.0.115 SDK_RID=freebsd.15-x64 SDKVERSIONSUFFIX=-servicing.26119.9 SDKSERVICESUFFIX=-servicing.26120.1 MANIFESTSUFFIX=9.0.100 NONPORTABLE= PYTHON_INCLUDEDIR=include/python3.12 PYTHON_LIBDIR=lib/python3.12 PYTHON_PLATFORM=freebsd15 PYTHON_SITELIBDIR=lib/python3.12/site-packages PYTHON_SUFFIX=312 PYTHON_BASESUFFIX=312 PYTHON_TAG=.cpython-312 PYTHON_SOABI=.cpython-312 PYTHON_VER=3.12 PYTHON_BASEVER=3.12 PYTHON_VERSION=python3.12 PYTHON2="@comment " PYTHON3="" VXSORT= OSREL=15.0 PREFIX=%D LOCALBASE=/usr/local RESETPREFIX=/usr/local LIB32DIR=lib DOCSDIR="share/doc/dotnet" EXAMPLESDIR="share/examples/dotnet" DATADIR="share/dotnet" WWWDIR="www/dotnet" ETCDIR="etc/dotnet"
--End PLIST_SUB--
--SUB_LIST--
PYTHON_INCLUDEDIR=/usr/local/include/python3.12 PYTHON_LIBDIR=/usr/local/lib/python3.12 PYTHON_PLATFORM=freebsd15 PYTHON_SITELIBDIR=/usr/local/lib/python3.12/site-packages PYTHON_SUFFIX=312 PYTHON_BASESUFFIX=312 PYTHON_TAG=.cpython-312 PYTHON_SOABI=.cpython-312 PYTHON_VER=3.12 PYTHON_BASEVER=3.12 PYTHON_VERSION=python3.12 PYTHON2="@comment " PYTHON3="" PREFIX=/usr/local LOCALBASE=/usr/local DATADIR=/usr/local/share/dotnet DOCSDIR=/usr/local/share/doc/dotnet EXAMPLESDIR=/usr/local/share/examples/dotnet WWWDIR=/usr/local/www/dotnet ETCDIR=/usr/local/etc/dotnet
--End SUB_LIST--
---Begin make.conf---
USE_PACKAGE_DEPENDS=yes
BATCH=yes
WRKDIRPREFIX=/wrkdirs
PORTSDIR=/usr/ports
PACKAGES=/packages
DISTDIR=/distfiles
PACKAGE_BUILDING=yes
PACKAGE_BUILDING_FLAVORS=yes
#### ####
# XXX: We really need this but cannot use it while 'make checksum' does not
# try the next mirror on checksum failure. It currently retries the same
# failed mirror and then fails rather then trying another. It *does*
# try the next if the size is mismatched though.
#MASTER_SITE_FREEBSD=yes
# Build ALLOW_MAKE_JOBS_PACKAGES with 3 jobs
MAKE_JOBS_NUMBER=3
#### Misc Poudriere ####
.include "/etc/make.conf.ports_env"
GID=0
UID=0
---End make.conf---
--Resource limits--
cpu time (seconds, -t) unlimited
file size (512-blocks, -f) unlimited
data seg size (kbytes, -d) 33554432
stack size (kbytes, -s) 524288
core file size (512-blocks, -c) unlimited
max memory size (kbytes, -m) unlimited
locked memory (kbytes, -l) unlimited
max user processes (-u) 89999
open files (-n) 8192
virtual mem size (kbytes, -v) unlimited
swap limit (kbytes, -w) unlimited
socket buffer size (bytes, -b) unlimited
pseudo-terminals (-p) unlimited
kqueues (-k) unlimited
umtx shared locks (-o) unlimited
pipebuf (-y) unlimited
--End resource limits--
=======================<phase: check-sanity >============================
===== env: NO_DEPENDS=yes USER=root UID=0 GID=0
===> License MIT accepted by the user
===========================================================================
=======================<phase: pkg-depends >============================
===== env: USE_PACKAGE_DEPENDS_ONLY=1 USER=root UID=0 GID=0
===> dotnet-9.0.14 depends on file: /usr/local/sbin/pkg - not found
===> Installing existing package /packages/All/pkg-2.8.4.pkg
[150amd64-default-job-17] Installing pkg-2.8.4...
[150amd64-default-job-17] Extracting pkg-2.8.4: .......... done
===> dotnet-9.0.14 depends on file: /usr/local/sbin/pkg - found
===> Returning to build of dotnet-9.0.14
===========================================================================
=======================<phase: fetch-depends >============================
===== env: USE_PACKAGE_DEPENDS_ONLY=1 USER=root UID=0 GID=0
===========================================================================
=======================<phase: fetch >============================
===== env: NO_DEPENDS=yes USER=root UID=0 GID=0
===> License MIT accepted by the user
===> Fetching all distfiles required by dotnet-9.0.14 for building
===========================================================================
=======================<phase: checksum >============================
===== env: NO_DEPENDS=yes USER=root UID=0 GID=0
===> License MIT accepted by the user
===> Fetching all distfiles required by dotnet-9.0.14 for building
=> SHA256 Checksum OK for dotnet/release.json-9.0.14.
=> SHA256 Checksum OK for dotnet/Private.SourceBuilt.Artifacts.9.0.110-servicing.25421.1.freebsd.13-x64.tar.gz.
=> SHA256 Checksum OK for dotnet/dotnet-sdk-9.0.110-freebsd-x64.tar.gz.
=> SHA256 Checksum OK for dotnet/dotnet-dotnet-9.0.14-v9.0.115_GH0.tar.gz.
===========================================================================
=======================<phase: extract-depends>============================
===== env: USE_PACKAGE_DEPENDS_ONLY=1 USER=root UID=0 GID=0
===========================================================================
=======================<phase: extract >============================
===== env: NO_DEPENDS=yes USER=root UID=0 GID=0
===> License MIT accepted by the user
===> Fetching all distfiles required by dotnet-9.0.14 for building
===> Extracting for dotnet-9.0.14
=> SHA256 Checksum OK for dotnet/release.json-9.0.14.
=> SHA256 Checksum OK for dotnet/Private.SourceBuilt.Artifacts.9.0.110-servicing.25421.1.freebsd.13-x64.tar.gz.
=> SHA256 Checksum OK for dotnet/dotnet-sdk-9.0.110-freebsd-x64.tar.gz.
=> SHA256 Checksum OK for dotnet/dotnet-dotnet-9.0.14-v9.0.115_GH0.tar.gz.
cp -f /portdistfiles/dotnet/release.json-9.0.14 /wrkdirs/usr/ports/lang/dotnet/work/dotnet-9.0.115/release.json
/usr/bin/tar -xf /portdistfiles/dotnet/Private.SourceBuilt.Artifacts.9.0.110-servicing.25421.1.freebsd.13-x64.tar.gz -C /wrkdirs/usr/ports/lang/dotnet/work/packages --no-same-owner --no-same-permissions
/usr/bin/tar -xf /portdistfiles/dotnet/dotnet-sdk-9.0.110-freebsd-x64.tar.gz -C /wrkdirs/usr/ports/lang/dotnet/work/bootstrap_sdk --no-same-owner --no-same-permissions
elfctl -e +noaslr /wrkdirs/usr/ports/lang/dotnet/work/bootstrap_sdk/dotnet
===========================================================================
=======================<phase: patch-depends >============================
===== env: USE_PACKAGE_DEPENDS_ONLY=1 USER=root UID=0 GID=0
===========================================================================
=======================<phase: patch >============================
===== env: NO_DEPENDS=yes USER=root UID=0 GID=0
===> Patching for dotnet-9.0.14
===> Applying extra patch /usr/ports/lang/dotnet/files/extra-patch-base-openssl
===> Applying FreeBSD patches for dotnet-9.0.14 from /usr/ports/lang/dotnet/files
cp -f /usr/ports/lang/dotnet/files/0002-Fix-assembly-version-calculation-in-2026.patch /wrkdirs/usr/ports/lang/dotnet/work/dotnet-9.0.115/src/source-build-externals/patches/azure-activedirectory-identitymodel-extensions-for-dotnet/
===========================================================================
=======================<phase: build-depends >============================
===== env: USE_PACKAGE_DEPENDS_ONLY=1 USER=root UID=0 GID=0
===> dotnet-9.0.14 depends on executable: bash - not found
===> Installing existing package /packages/All/bash-5.3.20.pkg
[150amd64-default-job-17] Installing bash-5.3.20...
[150amd64-default-job-17] `-- Installing gettext-runtime-1.0_1...
[150amd64-default-job-17] | `-- Installing indexinfo-0.3.1_1...
[150amd64-default-job-17] | `-- Extracting indexinfo-0.3.1_1: .... done
[150amd64-default-job-17] `-- Extracting gettext-runtime-1.0_1: .......... done
[150amd64-default-job-17] Extracting bash-5.3.20: .......... done
===> dotnet-9.0.14 depends on executable: bash - found
===> Returning to build of dotnet-9.0.14
===> dotnet-9.0.14 depends on executable: cmake - not found
===> Installing existing package /packages/All/cmake-core-3.31.12_3.pkg
[150amd64-default-job-17] Installing cmake-core-3.31.12_3...
<snip>
[ 5%] Building C object System.Globalization.Native/CMakeFiles/System.Globalization.Native-Static.dir/pal_common.c.o
[ 8%] Building C object System.Globalization.Native/CMakeFiles/System.Globalization.Native-Static.dir/pal_idna.c.o
[ 42%] Building C object System.Globalization.Native/CMakeFiles/System.Globalization.Native-Static.dir/pal_normalization.c.o
[ 47%] Building C object System.Globalization.Native/CMakeFiles/System.Globalization.Native-Static.dir/pal_icushim.c.o
[ 38%] Building C object System.Globalization.Native/CMakeFiles/System.Globalization.Native-Static.dir/pal_collation.c.o
[ 40%] Building C object System.Globalization.Native/CMakeFiles/System.Globalization.Native-Static.dir/pal_locale.c.o
[ 42%] Building C object System.Globalization.Native/CMakeFiles/System.Globalization.Native-Static.dir/pal_localeNumberData.c.o
[ 41%] Building C object System.Globalization.Native/CMakeFiles/System.Globalization.Native-Static.dir/pal_localeStringData.c.o
[ 48%] Building C object System.Globalization.Native/CMakeFiles/System.Globalization.Native-Static.dir/entrypoints.c.o
[ 50%] Building C object System.Native/CMakeFiles/System.Native.dir/pal_console.c.o
[ 52%] Building C object System.Globalization.Native/CMakeFiles/System.Globalization.Native-Static.dir/pal_timeZoneInfo.c.o
[ 55%] Built target System.IO.Ports.Native
[ 20%] Building C object System.Globalization.Native/CMakeFiles/System.Globalization.Native.dir/pal_casing.c.o
[ 15%] Building C object System.Globalization.Native/CMakeFiles/System.Globalization.Native.dir/pal_calendarData.c.o
[ 18%] Building C object System.Globalization.Native/CMakeFiles/System.Globalization.Native.dir/pal_common.c.o
[ 8%] Building C object System.Globalization.Native/CMakeFiles/System.Globalization.Native.dir/pal_idna.c.o
[ 54%] Building C object System.Globalization.Native/CMakeFiles/System.Globalization.Native.dir/pal_normalization.c.o
[ 34%] Building C object System.Globalization.Native/CMakeFiles/System.Globalization.Native.dir/pal_collation.c.o
[ 42%] Building C object System.Globalization.Native/CMakeFiles/System.Globalization.Native.dir/pal_locale.c.o
[ 42%] Building C object System.Globalization.Native/CMakeFiles/System.Globalization.Native.dir/pal_localeNumberData.c.o
[ 53%] Building C object System.Globalization.Native/CMakeFiles/System.Globalization.Native.dir/pal_localeStringData.c.o
[ 62%] Building C object System.Globalization.Native/CMakeFiles/System.Globalization.Native.dir/pal_icushim.c.o
[ 63%] Building C object System.Globalization.Native/CMakeFiles/System.Globalization.Native.dir/wrkdirs/usr/ports/lang/dotnet/work/dotnet-9.0.115/src/runtime/artifacts/obj/_version.c.o
[ 63%] Built target System.Net.Security.Native-Static
[ 63%] Building C object System.Globalization.Native/CMakeFiles/System.Globalization.Native.dir/pal_timeZoneInfo.c.o
Verifying System.Net.Security.Native entry points against entrypoints.c
[ 33%] Building C object System.Security.Cryptography.Native/CMakeFiles/objlib.dir/pal_evp_cipher.c.o
[ 33%] Building C object System.Security.Cryptography.Native/CMakeFiles/objlib.dir/pal_err.c.o
[ 32%] Building C object System.Security.Cryptography.Native/CMakeFiles/objlib.dir/pal_eckey.c.o
[ 18%] Building C object System.Security.Cryptography.Native/CMakeFiles/objlib.dir/pal_dsa.c.o
[ 19%] Building C object System.Security.Cryptography.Native/CMakeFiles/objlib.dir/pal_bio.c.o
[ 12%] Building C object System.Security.Cryptography.Native/CMakeFiles/objlib.dir/pal_bignum.c.o
[ 14%] Building C object System.Security.Cryptography.Native/CMakeFiles/objlib.dir/pal_asn1.c.o
[ 7%] Building C object System.Security.Cryptography.Native/CMakeFiles/objlib.dir/openssl.c.o
[ 7%] Building C object System.Security.Cryptography.Native/CMakeFiles/objlib.dir/apibridge_30.c.o
[ 2%] Building C object System.Security.Cryptography.Native/CMakeFiles/objlib.dir/apibridge.c.o
[ 56%] Building C object System.Security.Cryptography.Native/CMakeFiles/objlib.dir/pal_evp_pkey_rsa.c.o
[ 66%] Building C object System.Security.Cryptography.Native/CMakeFiles/objlib.dir/pal_hmac.c.o
[ 59%] Building C object System.Security.Cryptography.Native/CMakeFiles/objlib.dir/pal_ocsp.c.o
[ 65%] Building C object System.Security.Cryptography.Native/CMakeFiles/objlib.dir/pal_ssl.c.o
[ 63%] Building C object System.Security.Cryptography.Native/CMakeFiles/objlib.dir/pal_x509.c.o
[ 60%] Building C object System.Security.Cryptography.Native/CMakeFiles/objlib.dir/pal_x509_name.c.o
[ 26%] Building C object System.Security.Cryptography.Native/CMakeFiles/objlib.dir/pal_ecc_import_export.c.o
[ 65%] Building C object System.Security.Cryptography.Native/CMakeFiles/objlib.dir/pal_x509_root.c.o
[ 35%] Building C object System.Security.Cryptography.Native/CMakeFiles/objlib.dir/pal_evp.c.o
[ 47%] Building C object System.Security.Cryptography.Native/CMakeFiles/objlib.dir/pal_evp_kdf.c.o
[ 52%] Building C object System.Security.Cryptography.Native/CMakeFiles/objlib.dir/pal_evp_mac.c.o
[ 48%] Building C object System.Security.Cryptography.Native/CMakeFiles/objlib.dir/pal_evp_pkey.c.o
[ 54%] Building C object System.Security.Cryptography.Native/CMakeFiles/objlib.dir/pal_evp_pkey_dsa.c.o
[ 51%] Building C object System.Security.Cryptography.Native/CMakeFiles/objlib.dir/pal_evp_pkey_ecdh.c.o
[ 52%] Building C object System.Security.Cryptography.Native/CMakeFiles/objlib.dir/pal_evp_pkey_ecdsa.c.o
[ 49%] Building C object System.Security.Cryptography.Native/CMakeFiles/objlib.dir/pal_evp_pkey_eckey.c.o
[ 66%] Building C object System.Security.Cryptography.Native/CMakeFiles/objlib.dir/pal_pkcs7.c.o
[ 66%] Building C object System.Security.Cryptography.Native/CMakeFiles/objlib.dir/wrkdirs/usr/ports/lang/dotnet/work/dotnet-9.0.115/src/runtime/artifacts/obj/_version.c.o
[ 67%] Building C object System.Security.Cryptography.Native/CMakeFiles/objlib.dir/pal_x509ext.c.o
[ 75%] Linking C shared library libSystem.Native.so
[ 79%] Linking C static library libSystem.Globalization.Native.a
[ 86%] Linking C shared library libSystem.Globalization.Native.so
[ 86%] Built target System.Globalization.Native-Static
[ 87%] Built target System.Net.Security.Native
Verifying System.Native entry points against entrypoints.c
[ 90%] Built target objlib
[ 88%] Building C object System.Native/CMakeFiles/System.Native-Static.dir/pal_searchpath.c.o
[ 87%] Building C object System.Native/CMakeFiles/System.Native-Static.dir/pal_environment.c.o
[ 84%] Building C object System.Native/CMakeFiles/System.Native-Static.dir/pal_uid.c.o
[ 83%] Building C object System.Native/CMakeFiles/System.Native-Static.dir/pal_threading.c.o
[ 76%] Building C object System.Native/CMakeFiles/System.Native-Static.dir/pal_signal.c.o
[ 72%] Building C object System.Native/CMakeFiles/System.Native-Static.dir/pal_process.c.o
[ 70%] Building C object System.Native/CMakeFiles/System.Native-Static.dir/pal_mount.c.o
[ 69%] Building C object System.Native/CMakeFiles/System.Native-Static.dir/pal_dynamicload.c.o
[ 68%] Building C object System.Native/CMakeFiles/System.Native-Static.dir/wrkdirs/usr/ports/lang/dotnet/work/dotnet-9.0.115/src/runtime/src/native/minipal/random.c.o
[ 68%] Building C object System.Native/CMakeFiles/System.Native-Static.dir/pal_sysctl.c.o
[ 66%] Building C object System.Native/CMakeFiles/System.Native-Static.dir/pal_datetime.c.o
[ 61%] Building C object System.Native/CMakeFiles/System.Native-Static.dir/pal_time.c.o
[ 57%] Building C object System.Native/CMakeFiles/System.Native-Static.dir/pal_tcpstate.c.o
[ 48%] Building C object System.Native/CMakeFiles/System.Native-Static.dir/pal_string.c.o
[ 43%] Building C object System.Native/CMakeFiles/System.Native-Static.dir/pal_runtimeinformation.c.o
[ 33%] Building C object System.Native/CMakeFiles/System.Native-Static.dir/pal_random.c.o
[ 31%] Building C object System.Native/CMakeFiles/System.Native-Static.dir/pal_networkstatistics.c.o
[ 24%] Building C object System.Native/CMakeFiles/System.Native-Static.dir/pal_memory.c.o
[ 34%] Building C object System.Native/CMakeFiles/System.Native-Static.dir/pal_maphardwaretype.c.o
[ 32%] Building C object System.Native/CMakeFiles/System.Native-Static.dir/pal_io.c.o
[ 16%] Building C object System.Native/CMakeFiles/System.Native-Static.dir/pal_interfaceaddresses.c.o
[ 12%] Building C object System.Native/CMakeFiles/System.Native-Static.dir/pal_errno.c.o
[ 89%] Building C object System.Native/CMakeFiles/System.Native-Static.dir/pal_log.c.o
[ 90%] Building C object System.Native/CMakeFiles/System.Native-Static.dir/pal_iossupportversion.c.o
[ 87%] Building C object System.Native/CMakeFiles/System.Native-Static.dir/pal_autoreleasepool.c.o
[ 71%] Building C object System.Native/CMakeFiles/System.Native-Static.dir/pal_networking.c.o
[ 90%] Building C object System.Native/CMakeFiles/System.Native-Static.dir/pal_console.c.o
[ 81%] Building C object _deps/fetchzlibng-build/CMakeFiles/zlib.dir/arch/x86/compare256_sse2.c.o
[ 77%] Building C object _deps/fetchzlibng-build/CMakeFiles/zlib.dir/cpu_features.c.o
[ 74%] Building C object _deps/fetchzlibng-build/CMakeFiles/zlib.dir/zutil.c.o
[ 74%] Building C object _deps/fetchzlibng-build/CMakeFiles/zlib.dir/uncompr.c.o
[ 77%] Building C object _deps/fetchzlibng-build/CMakeFiles/zlib.dir/insert_string_roll.c.o
[ 77%] Building C object _deps/fetchzlibng-build/CMakeFiles/zlib.dir/insert_string.c.o
[ 70%] Building C object _deps/fetchzlibng-build/CMakeFiles/zlib.dir/inftrees.c.o
[ 72%] Building C object _deps/fetchzlibng-build/CMakeFiles/zlib.dir/infback.c.o
[ 66%] Building C object _deps/fetchzlibng-build/CMakeFiles/zlib.dir/functable.c.o
[ 55%] Building C object _deps/fetchzlibng-build/CMakeFiles/zlib.dir/deflate_stored.c.o
[ 54%] Building C object _deps/fetchzlibng-build/CMakeFiles/zlib.dir/deflate_slow.c.o
[ 66%] Building C object _deps/fetchzlibng-build/CMakeFiles/zlib.dir/deflate_rle.c.o
[ 54%] Building C object _deps/fetchzlibng-build/CMakeFiles/zlib.dir/deflate_quick.c.o
[ 54%] Building C object _deps/fetchzlibng-build/CMakeFiles/zlib.dir/deflate_medium.c.o
[ 64%] Building C object _deps/fetchzlibng-build/CMakeFiles/zlib.dir/deflate_huff.c.o
[ 55%] Building C object _deps/fetchzlibng-build/CMakeFiles/zlib.dir/deflate_fast.c.o
[ 58%] Building C object _deps/fetchzlibng-build/CMakeFiles/zlib.dir/deflate.c.o
[ 44%] Building C object _deps/fetchzlibng-build/CMakeFiles/zlib.dir/crc32_braid_comb.c.o
[ 37%] Building C object _deps/fetchzlibng-build/CMakeFiles/zlib.dir/crc32.c.o
[ 34%] Building C object _deps/fetchzlibng-build/CMakeFiles/zlib.dir/compress.c.o
[ 29%] Building C object _deps/fetchzlibng-build/CMakeFiles/zlib.dir/adler32.c.o
[ 18%] Building C object _deps/fetchzlibng-build/CMakeFiles/zlib.dir/arch/generic/slide_hash_c.c.o
[ 15%] Building C object _deps/fetchzlibng-build/CMakeFiles/zlib.dir/arch/generic/crc32_fold_c.c.o
[ 8%] Building C object _deps/fetchzlibng-build/CMakeFiles/zlib.dir/arch/generic/crc32_braid_c.c.o
[ 6%] Building C object _deps/fetchzlibng-build/CMakeFiles/zlib.dir/arch/generic/compare256_c.c.o
[ 6%] Building C object _deps/fetchzlibng-build/CMakeFiles/zlib.dir/arch/generic/chunkset_c.c.o
[ 4%] Building C object _deps/fetchzlibng-build/CMakeFiles/zlib.dir/arch/generic/adler32_fold_c.c.o
[ 2%] Building C object _deps/fetchzlibng-build/CMakeFiles/zlib.dir/arch/generic/adler32_c.c.o
[ 83%] Building C object _deps/fetchzlibng-build/CMakeFiles/zlib.dir/arch/x86/chunkset_avx2.c.o
[ 86%] Building C object _deps/fetchzlibng-build/CMakeFiles/zlib.dir/arch/x86/compare256_avx2.c.o
[ 71%] Building C object _deps/fetchzlibng-build/CMakeFiles/zlib.dir/inflate.c.o
[ 89%] Building C object _deps/fetchzlibng-build/CMakeFiles/zlib.dir/arch/x86/adler32_avx2.c.o
[ 89%] Building C object _deps/fetchzlibng-build/CMakeFiles/zlib.dir/arch/x86/adler32_avx512.c.o
[ 91%] Building C object _deps/fetchzlibng-build/CMakeFiles/zlib.dir/arch/x86/adler32_avx512_vnni.c.o
[ 73%] Building C object _deps/fetchzlibng-build/CMakeFiles/zlib.dir/trees.c.o
[ 90%] Building C object _deps/fetchzlibng-build/CMakeFiles/zlib.dir/arch/x86/crc32_vpclmulqdq.c.o
[ 92%] Building C object _deps/fetchzlibng-build/CMakeFiles/zlib.dir/gzlib.c.o
[ 78%] Building C object _deps/fetchzlibng-build/CMakeFiles/zlib.dir/arch/x86/x86_features.c.o
[ 78%] Building C object _deps/fetchzlibng-build/CMakeFiles/zlib.dir/arch/x86/chunkset_sse2.c.o
[ 78%] Building C object _deps/fetchzlibng-build/CMakeFiles/zlib.dir/arch/x86/slide_hash_sse2.c.o
[ 80%] Building C object _deps/fetchzlibng-build/CMakeFiles/zlib.dir/arch/x86/adler32_ssse3.c.o
[ 80%] Building C object _deps/fetchzlibng-build/CMakeFiles/zlib.dir/arch/x86/chunkset_ssse3.c.o
[ 82%] Building C object _deps/fetchzlibng-build/CMakeFiles/zlib.dir/arch/x86/adler32_sse42.c.o
[ 85%] Building C object _deps/fetchzlibng-build/CMakeFiles/zlib.dir/arch/x86/crc32_pclmulqdq.c.o
[ 82%] Building C object _deps/fetchzlibng-build/CMakeFiles/zlib.dir/arch/x86/slide_hash_avx2.c.o
[ 92%] Building C object _deps/fetchzlibng-build/CMakeFiles/zlib.dir/gzread.c.o
[ 94%] Building C object System.Native/CMakeFiles/System.Native-Static.dir/pal_networkchange.c.o
[ 93%] Building C object _deps/fetchzlibng-build/CMakeFiles/zlib.dir/gzwrite.c.o
Verifying System.Globalization.Native.so dependencies
[ 94%] Built target System.Native
[ 95%] Linking C shared library libSystem.Security.Cryptography.Native.OpenSsl.so
[ 95%] Building C object System.Security.Cryptography.Native/CMakeFiles/System.Security.Cryptography.Native.OpenSsl-Static.dir/entrypoints.c.o
[ 95%] Linking C static library libSystem.Native.a
[ 95%] Built target System.Globalization.Native
[ 95%] Built target System.Native-Static
Verifying System.Security.Cryptography.Native.OpenSsl entry points against entrypoints.c
[ 96%] Linking C static library libSystem.Security.Cryptography.Native.OpenSsl.a
[ 96%] Built target System.Security.Cryptography.Native.OpenSsl-Static
[ 96%] Built target System.Security.Cryptography.Native.OpenSsl
[ 97%] Linking C static library libz.a
[ 97%] Built target zlib
[ 98%] Building C object System.IO.Compression.Native/CMakeFiles/System.IO.Compression.Native-Static.dir/entrypoints.c.o
[ 99%] Building C object System.IO.Compression.Native/CMakeFiles/System.IO.Compression.Native.dir/entrypoints.c.o
[ 99%] Building C object System.IO.Compression.Native/CMakeFiles/System.IO.Compression.Native-Static.dir/pal_zlib.c.o
[ 99%] Building C object System.IO.Compression.Native/CMakeFiles/System.IO.Compression.Native.dir/pal_zlib.c.o
[ 99%] Building C object System.IO.Compression.Native/CMakeFiles/System.IO.Compression.Native.dir/wrkdirs/usr/ports/lang/dotnet/work/dotnet-9.0.115/src/runtime/artifacts/obj/_version.c.o
[100%] Linking C shared library libSystem.IO.Compression.Native.so
[100%] Linking C static library libSystem.IO.Compression.Native.a
[100%] Built target System.IO.Compression.Native-Static
[100%] Built target System.IO.Compression.Native
Install the project...
-- Install configuration: "RELEASE"
-- Installing: /wrkdirs/usr/ports/lang/dotnet/work/dotnet-9.0.115/src/runtime/artifacts/bin/native/net9.0-freebsd-Release-x64/./libSystem.IO.Compression.Native.so
-- Installing: /wrkdirs/usr/ports/lang/dotnet/work/dotnet-9.0.115/src/runtime/artifacts/bin/native/net9.0-freebsd-Release-x64/./libSystem.IO.Compression.Native.a
-- Installing: /wrkdirs/usr/ports/lang/dotnet/work/dotnet-9.0.115/src/runtime/artifacts/bin/native/net9.0-freebsd-Release-x64/./libSystem.IO.Ports.Native.so
-- Installing: /wrkdirs/usr/ports/lang/dotnet/work/dotnet-9.0.115/src/runtime/artifacts/bin/native/net9.0-freebsd-Release-x64/./libSystem.IO.Ports.Native.a
-- Installing: /wrkdirs/usr/ports/lang/dotnet/work/dotnet-9.0.115/src/runtime/artifacts/bin/native/net9.0-freebsd-Release-x64/./libSystem.Native.so
-- Installing: /wrkdirs/usr/ports/lang/dotnet/work/dotnet-9.0.115/src/runtime/artifacts/bin/native/net9.0-freebsd-Release-x64/./libSystem.Native.a
-- Installing: /wrkdirs/usr/ports/lang/dotnet/work/dotnet-9.0.115/src/runtime/artifacts/bin/native/net9.0-freebsd-Release-x64/./libSystem.Globalization.Native.so
-- Installing: /wrkdirs/usr/ports/lang/dotnet/work/dotnet-9.0.115/src/runtime/artifacts/bin/native/net9.0-freebsd-Release-x64/./libSystem.Globalization.Native.a
-- Installing: /wrkdirs/usr/ports/lang/dotnet/work/dotnet-9.0.115/src/runtime/artifacts/bin/native/net9.0-freebsd-Release-x64/./libSystem.Net.Security.Native.so
-- Installing: /wrkdirs/usr/ports/lang/dotnet/work/dotnet-9.0.115/src/runtime/artifacts/bin/native/net9.0-freebsd-Release-x64/./libSystem.Net.Security.Native.a
-- Installing: /wrkdirs/usr/ports/lang/dotnet/work/dotnet-9.0.115/src/runtime/artifacts/bin/native/net9.0-freebsd-Release-x64/./libSystem.Security.Cryptography.Native.OpenSsl.so
-- Installing: /wrkdirs/usr/ports/lang/dotnet/work/dotnet-9.0.115/src/runtime/artifacts/bin/native/net9.0-freebsd-Release-x64/./libSystem.Security.Cryptography.Native.OpenSsl.a
~/dotnet-9.0.115/src/runtime/src/native/libs
MSBUILD : error MSB4223: A node of the required type OutOfProc could not be created.
Build FAILED.
MSBUILD : error MSB4223: A node of the required type OutOfProc could not be created.
0 Warning(s)
1 Error(s)
Time Elapsed 01:10:48.72
Build failed with exit code 1. Check errors above.
/wrkdirs/usr/ports/lang/dotnet/work/dotnet-9.0.115/artifacts/source-built-sdks/Microsoft.DotNet.Arcade.Sdk/tools/SourceBuild/SourceBuildArcadeBuild.targets(130,5): error MSB3073: The command "./build.sh --restore --build --publish --arch x64 --configuration Release --allconfigurations --verbosity minimal --nodereuse false --warnAsError false --outputrid freebsd.15-x64 /p:PackageOS=freebsd /p:ToolsOS=freebsd /p:AdditionalRuntimeIdentifierParent=freebsd-x64 /p:DotNetBuildRepo=true /p:DotNetBuildOrchestrator=true /p:OfficialBuildId=20260219.10 /p:ContinuousIntegrationBuild=true /p:PortableBuild=false /p:RestoreConfigFile=/wrkdirs/usr/ports/lang/dotnet/work/dotnet-9.0.115/artifacts/obj/runtime/NuGet.config /p:SourceBuiltAssetsDir=/wrkdirs/usr/ports/lang/dotnet/work/dotnet-9.0.115/artifacts/assets/Release/ /p:SourceBuiltShippingPackagesDir=/wrkdirs/usr/ports/lang/dotnet/work/dotnet-9.0.115/artifacts/packages/Release/Shipping/runtime/ /p:SourceBuiltNonShippingPackagesDir=/wrkdi
rs/usr/ports/lang/dotnet/work/dotnet-9.0.115/artifacts/packages/Release/NonShipping/runtime/ /p:SourceBuiltAssetManifestsDir=/wrkdirs/usr/ports/lang/dotnet/work/dotnet-9.0.115/artifacts/obj/AssetManifests/runtime/ /p:SourceBuiltSymbolsDir=/wrkdirs/usr/ports/lang/dotnet/work/dotnet-9.0.115/artifacts/obj/Symbols/runtime/ /p:GitHubRepositoryName=runtime --cmakeargs -DCLR_CMAKE_USE_SYSTEM_BROTLI=true /p:DotNetBuildInnerRepo=true /p:DotNetBuildSourceOnly=true /p:ArcadeInnerBuildFromSource=true /p:DotNetBuildFromSource=true /p:RepoRoot="/wrkdirs/usr/ports/lang/dotnet/work/dotnet-9.0.115/src/runtime/" /p:ArtifactsDir="/wrkdirs/usr/ports/lang/dotnet/work/dotnet-9.0.115/src/runtime/artifacts/" /bl:"/wrkdirs/usr/ports/lang/dotnet/work/dotnet-9.0.115/src/runtime/artifacts/log/Release/source-inner-build.binlog" /p:ContinuousIntegrationBuild=true /p:SourceBuildOutputDir="/wrkdirs/usr/ports/lang/dotnet/work/dotnet-9.0.115/src/runtime/artifacts/sb/" /p:DotNetPackageVersionPropsPath="/wrkdi
rs/usr/ports/lang/dotnet/work/dotnet-9.0.115/artifacts/obj/PackageVersions/PackageVersions.runtime.props" /p:FullAssemblySigningSupported=false /p:DotNetPublishUsingPipelines=true /p:GitHubRepositoryName=runtime" exited with code 1. [/wrkdirs/usr/ports/lang/dotnet/work/dotnet-9.0.115/artifacts/source-built-sdks/Microsoft.DotNet.Arcade.Sdk/tools/Build.proj]
##vso[task.logissue type=error;sourcepath=/wrkdirs/usr/ports/lang/dotnet/work/dotnet-9.0.115/artifacts/source-built-sdks/Microsoft.DotNet.Arcade.Sdk/tools/SourceBuild/SourceBuildArcadeBuild.targets;linenumber=130;columnnumber=5;code=MSB3073;]The command "./build.sh --restore --build --publish --arch x64 --configuration Release --allconfigurations --verbosity minimal --nodereuse false --warnAsError false --outputrid freebsd.15-x64 /p:PackageOS=freebsd /p:ToolsOS=freebsd /p:AdditionalRuntimeIdentifierParent=freebsd-x64 /p:DotNetBuildRepo=true /p:DotNetBuildOrchestrator=true /p:OfficialBuildId=20260219.10 /p:ContinuousIntegrationBuild=true /p:PortableBuild=false /p:RestoreConfigFile=/wrkdirs/usr/ports/lang/dotnet/work/dotnet-9.0.115/artifacts/obj/runtime/NuGet.config /p:SourceBuiltAssetsDir=/wrkdirs/usr/ports/lang/dotnet/work/dotnet-9.0.115/artifacts/assets/Release/ /p:SourceBuiltShippingPackagesDir=/wrkdirs/usr/ports/lang/dotnet/work/dotnet-9.0.115/artifacts/packages/Releas
e/Shipping/runtime/ /p:SourceBuiltNonShippingPackagesDir=/wrkdirs/usr/ports/lang/dotnet/work/dotnet-9.0.115/artifacts/packages/Release/NonShipping/runtime/ /p:SourceBuiltAssetManifestsDir=/wrkdirs/usr/ports/lang/dotnet/work/dotnet-9.0.115/artifacts/obj/AssetManifests/runtime/ /p:SourceBuiltSymbolsDir=/wrkdirs/usr/ports/lang/dotnet/work/dotnet-9.0.115/artifacts/obj/Symbols/runtime/ /p:GitHubRepositoryName=runtime --cmakeargs -DCLR_CMAKE_USE_SYSTEM_BROTLI=true /p:DotNetBuildInnerRepo=true /p:DotNetBuildSourceOnly=true /p:ArcadeInnerBuildFromSource=true /p:DotNetBuildFromSource=true /p:RepoRoot="/wrkdirs/usr/ports/lang/dotnet/work/dotnet-9.0.115/src/runtime/" /p:ArtifactsDir="/wrkdirs/usr/ports/lang/dotnet/work/dotnet-9.0.115/src/runtime/artifacts/" /bl:"/wrkdirs/usr/ports/lang/dotnet/work/dotnet-9.0.115/src/runtime/artifacts/log/Release/source-inner-build.binlog" /p:ContinuousIntegrationBuild=true /p:SourceBuildOutputDir="/wrkdirs/usr/ports/lang/dotnet/work/dotnet-9.0.115/src/
runtime/artifacts/sb/" /p:DotNetPackageVersionPropsPath="/wrkdirs/usr/ports/lang/dotnet/work/dotnet-9.0.115/artifacts/obj/PackageVersions/PackageVersions.runtime.props" /p:FullAssemblySigningSupported=false /p:DotNetPublishUsingPipelines=true /p:GitHubRepositoryName=runtime" exited with code 1.
Build FAILED.
/wrkdirs/usr/ports/lang/dotnet/work/dotnet-9.0.115/artifacts/source-built-sdks/Microsoft.DotNet.Arcade.Sdk/tools/SourceBuild/SourceBuildArcadeBuild.targets(130,5): error MSB3073: The command "./build.sh --restore --build --publish --arch x64 --configuration Release --allconfigurations --verbosity minimal --nodereuse false --warnAsError false --outputrid freebsd.15-x64 /p:PackageOS=freebsd /p:ToolsOS=freebsd /p:AdditionalRuntimeIdentifierParent=freebsd-x64 /p:DotNetBuildRepo=true /p:DotNetBuildOrchestrator=true /p:OfficialBuildId=20260219.10 /p:ContinuousIntegrationBuild=true /p:PortableBuild=false /p:RestoreConfigFile=/wrkdirs/usr/ports/lang/dotnet/work/dotnet-9.0.115/artifacts/obj/runtime/NuGet.config /p:SourceBuiltAssetsDir=/wrkdirs/usr/ports/lang/dotnet/work/dotnet-9.0.115/artifacts/assets/Release/ /p:SourceBuiltShippingPackagesDir=/wrkdirs/usr/ports/lang/dotnet/work/dotnet-9.0.115/artifacts/packages/Release/Shipping/runtime/ /p:SourceBuiltNonShippingPackagesDir=/wrkdi
rs/usr/ports/lang/dotnet/work/dotnet-9.0.115/artifacts/packages/Release/NonShipping/runtime/ /p:SourceBuiltAssetManifestsDir=/wrkdirs/usr/ports/lang/dotnet/work/dotnet-9.0.115/artifacts/obj/AssetManifests/runtime/ /p:SourceBuiltSymbolsDir=/wrkdirs/usr/ports/lang/dotnet/work/dotnet-9.0.115/artifacts/obj/Symbols/runtime/ /p:GitHubRepositoryName=runtime --cmakeargs -DCLR_CMAKE_USE_SYSTEM_BROTLI=true /p:DotNetBuildInnerRepo=true /p:DotNetBuildSourceOnly=true /p:ArcadeInnerBuildFromSource=true /p:DotNetBuildFromSource=true /p:RepoRoot="/wrkdirs/usr/ports/lang/dotnet/work/dotnet-9.0.115/src/runtime/" /p:ArtifactsDir="/wrkdirs/usr/ports/lang/dotnet/work/dotnet-9.0.115/src/runtime/artifacts/" /bl:"/wrkdirs/usr/ports/lang/dotnet/work/dotnet-9.0.115/src/runtime/artifacts/log/Release/source-inner-build.binlog" /p:ContinuousIntegrationBuild=true /p:SourceBuildOutputDir="/wrkdirs/usr/ports/lang/dotnet/work/dotnet-9.0.115/src/runtime/artifacts/sb/" /p:DotNetPackageVersionPropsPath="/wrkdi
rs/usr/ports/lang/dotnet/work/dotnet-9.0.115/artifacts/obj/PackageVersions/PackageVersions.runtime.props" /p:FullAssemblySigningSupported=false /p:DotNetPublishUsingPipelines=true /p:GitHubRepositoryName=runtime" exited with code 1. [/wrkdirs/usr/ports/lang/dotnet/work/dotnet-9.0.115/artifacts/source-built-sdks/Microsoft.DotNet.Arcade.Sdk/tools/Build.proj]
0 Warning(s)
1 Error(s)
Time Elapsed 01:10:49.77
Build failed with exit code 1. Check errors above.
/wrkdirs/usr/ports/lang/dotnet/work/dotnet-9.0.115/repo-projects/Directory.Build.targets(459,5): error MSB3073: The command "/wrkdirs/usr/ports/lang/dotnet/work/dotnet-9.0.115/src/runtime/build.sh --restore --build --pack --publish --ci --configuration Release -bl /p:DotNetBuildRepo=true /p:DotNetBuildOrchestrator=true /p:RestoreConfigFile=/wrkdirs/usr/ports/lang/dotnet/work/dotnet-9.0.115/artifacts/obj/runtime/NuGet.config /p:SourceBuiltAssetsDir=/wrkdirs/usr/ports/lang/dotnet/work/dotnet-9.0.115/artifacts/assets/Release/ /p:SourceBuiltAssetManifestsDir=/wrkdirs/usr/ports/lang/dotnet/work/dotnet-9.0.115/artifacts/obj/AssetManifests/runtime/ /p:SourceBuiltSymbolsDir=/wrkdirs/usr/ports/lang/dotnet/work/dotnet-9.0.115/artifacts/obj/Symbols/runtime/ /p:ArcadeBuildFromSource=true /p:DotNetBuildSourceOnly=true /p:PreviouslySourceBuiltNupkgCacheDir="/wrkdirs/usr/ports/lang/dotnet/work/packages/" /p:ReferencePackageNupkgCacheDir="/wrkdirs/usr/ports/lang/dotnet/work/dotnet-9.0.115/p
rereqs/packages/reference/" --arch x64 --os freebsd /p:TargetRid=freebsd.15-x64 /p:RuntimeOS=freebsd /p:BaseOS=freebsd-x64 /p:PortableBuild=false /p:SourceBuildNonPortable=true /p:UsingToolMicrosoftNetCompilers=false /p:SourceBuiltShippingPackagesDir=/wrkdirs/usr/ports/lang/dotnet/work/dotnet-9.0.115/artifacts/packages/Release/Shipping/runtime/ /p:SourceBuiltNonShippingPackagesDir=/wrkdirs/usr/ports/lang/dotnet/work/dotnet-9.0.115/artifacts/packages/Release/NonShipping/runtime/" exited with code 1. [/wrkdirs/usr/ports/lang/dotnet/work/dotnet-9.0.115/repo-projects/runtime.proj]
*** Error code 1
Stop.
make: stopped making "build" in /usr/ports/lang/dotnet