[package - main-arm64-default][ports-mgmt/appstream-generator] Failed for appstream-generator-1.0.0 in build
- Go to: [ bottom of page ] [ top of archives ] [ this month ]
Date: Wed, 16 Sep 2026 01:53:33 UTC
You are receiving this mail as a port that you maintain
is failing to build on the FreeBSD package build server.
Please investigate the failure and submit a PR to fix
build.
Maintainer: arrowd@FreeBSD.org
Log URL: https://pkg-status.freebsd.org/ampere2/data/main-arm64-default/pe26b1e4bc8ec_sb2a270da9fb/logs/appstream-generator-1.0.0.log
Build URL: https://pkg-status.freebsd.org/ampere2/build.html?mastername=main-arm64-default&build=pe26b1e4bc8ec_sb2a270da9fb
Log:
=>> Building ports-mgmt/appstream-generator
build started at Wed Sep 16 01:50:07 UTC 2026
port directory: /usr/ports/ports-mgmt/appstream-generator
package name: appstream-generator-1.0.0
building for: FreeBSD main-arm64-default-job-01 16.0-CURRENT FreeBSD 16.0-CURRENT 1600025 arm64
maintained by: arrowd@FreeBSD.org
Makefile datestamp: -rw-r--r-- 1 root wheel 1727 Sep 10 01:08 /usr/ports/ports-mgmt/appstream-generator/Makefile
Ports top last git commit: e26b1e4bc8ec94e73586539808ef21695232e8aa
Ports top unclean checkout: no
Port dir last git commit: 924e2bd965b5e96a775c07557b0019cdda0a86eb
Port dir unclean checkout: no
Poudriere version: poudriere-git-3.4.8-2-g2e891d4a
Host OSVERSION: 1600022
Jail OSVERSION: 1600025
Job Id: 01
!!! Jail is newer than host. (Jail: 1600025, Host: 1600022) !!!
!!! This is not supported. !!!
!!! Host kernel must be same or newer than jail. !!!
!!! Expect build failures. !!!
---Begin Environment---
SHELL=/bin/sh
OSVERSION=1600025
UNAME_v=FreeBSD 16.0-CURRENT 1600025
UNAME_r=16.0-CURRENT
BLOCKSIZE=K
MAIL=/var/mail/root
MM_CHARSET=UTF-8
LANG=C.UTF-8
STATUS=1
HOME=/root
PATH=/sbin:/bin:/usr/sbin:/usr/bin:/usr/local/sbin:/usr/local/bin:/root/bin
MAKE_OBJDIR_CHECK_WRITABLE=0
LOCALBASE=/usr/local
USER=root
POUDRIERE_NAME=poudriere-git
LIBEXECPREFIX=/usr/local/libexec/poudriere
POUDRIERE_VERSION=3.4.8-2-g2e891d4a
MASTERMNT=/usr/local/poudriere/data/.m/main-arm64-default/ref
LC_COLLATE=C
POUDRIERE_BUILD_TYPE=bulk
PACKAGE_BUILDING=yes
SAVED_TERM=
OUTPUT_REDIRECTED_STDERR=4
OUTPUT_REDIRECTED=1
PWD=/usr/local/poudriere/data/.m/main-arm64-default/01/.p
OUTPUT_REDIRECTED_STDOUT=3
P_PORTS_FEATURES=FLAVORS SUBPACKAGES SELECTED_OPTIONS
MASTERNAME=main-arm64-default
SCRIPTPREFIX=/usr/local/share/poudriere
SCRIPTNAME=bulk.sh
OLDPWD=/usr/local/poudriere/data/.m/main-arm64-default/ref/.p/pool
POUDRIERE_PKGNAME=poudriere-git-3.4.8-2-g2e891d4a
SCRIPTPATH=/usr/local/share/poudriere/bulk.sh
POUDRIEREPATH=/usr/local/bin/poudriere
---End Environment---
---Begin Poudriere Port Flags/Env---
PORT_FLAGS=
PKGENV=
FLAVOR=
MAKE_ARGS=
---End Poudriere Port Flags/Env---
---Begin OPTIONS List---
===> The following configuration options are available for appstream-generator-1.0.0:
MANPAGES=off: Build and/or install manual pages
===> Use 'make config' to modify these settings
---End OPTIONS List---
--MAINTAINER--
arrowd@FreeBSD.org
--End MAINTAINER--
--CONFIGURE_ARGS--
setup --prefix /usr/local --localstatedir /var --infodir share/info --auto-features=enabled -Dpython.bytecompile=-1 -Db_colorout=never --buildtype release --optimization plain --strip -Dbackward=false _build
--End CONFIGURE_ARGS--
--CONFIGURE_ENV--
PKG_CONFIG=pkgconf XDG_DATA_HOME=/wrkdirs/usr/ports/ports-mgmt/appstream-generator/work XDG_CONFIG_HOME=/wrkdirs/usr/ports/ports-mgmt/appstream-generator/work XDG_CACHE_HOME=/wrkdirs/usr/ports/ports-mgmt/appstream-generator/work/.cache HOME=/wrkdirs/usr/ports/ports-mgmt/appstream-generator/work TMPDIR="/tmp" PATH=/wrkdirs/usr/ports/ports-mgmt/appstream-generator/work/.bin:/sbin:/bin:/usr/sbin:/usr/bin:/usr/local/sbin:/usr/local/bin:/root/bin PKG_CONFIG_LIBDIR=/wrkdirs/usr/ports/ports-mgmt/appstream-generator/work/.pkgconfig:/usr/local/libdata/pkgconfig:/usr/local/share/pkgconfig:/usr/libdata/pkgconfig SHELL=/bin/sh CONFIG_SHELL=/bin/sh CMAKE_PREFIX_PATH="/usr/local"
--End CONFIGURE_ENV--
--MAKE_ENV--
NINJA_STATUS="[%p %s/%t] " XDG_DATA_HOME=/wrkdirs/usr/ports/ports-mgmt/appstream-generator/work XDG_CONFIG_HOME=/wrkdirs/usr/ports/ports-mgmt/appstream-generator/work XDG_CACHE_HOME=/wrkdirs/usr/ports/ports-mgmt/appstream-generator/work/.cache HOME=/wrkdirs/usr/ports/ports-mgmt/appstream-generator/work TMPDIR="/tmp" PATH=/wrkdirs/usr/ports/ports-mgmt/appstream-generator/work/.bin:/sbin:/bin:/usr/sbin:/usr/bin:/usr/local/sbin:/usr/local/bin:/root/bin PKG_CONFIG_LIBDIR=/wrkdirs/usr/ports/ports-mgmt/appstream-generator/work/.pkgconfig:/usr/local/libdata/pkgconfig:/usr/local/share/pkgconfig:/usr/libdata/pkgconfig MK_DEBUG_FILES=no MK_KERNEL_SYMBOLS=no SHELL=/bin/sh NO_LINT=YES DESTDIR=/wrkdirs/usr/ports/ports-mgmt/appstream-generator/work/stage PREFIX=/usr/local LOCALBASE=/usr/local CC="cc" CFLAGS="-O2 -pipe -fexperimental-library -fstack-protector-strong -isystem /usr/local/include -fno-strict-aliasing " CPP="cpp" CPPFLAGS="-isystem /usr/local/include" LDFLAGS=" -Wl,--f
ix-cortex-a53-843419 " LIBS="-L/usr/local/lib" CXX="c++" CXXFLAGS="-O2 -pipe -fexperimental-library -fstack-protector-strong -isystem /usr/local/include -fno-strict-aliasing -isystem /usr/local/include -std=c++23 " CXXSTD=c++23 BSD_INSTALL_PROGRAM="install -s -m 555" BSD_INSTALL_LIB="install -s -m 0644" BSD_INSTALL_SCRIPT="install -m 555" BSD_INSTALL_DATA="install -m 0644" BSD_INSTALL_MAN="install -m 444"
--End MAKE_ENV--
--PLIST_SUB--
MANPAGES="@comment " NO_MANPAGES="" GTK2_VERSION="2.10.0" GTK3_VERSION="3.0.0" GTK4_VERSION="4.0.0" OSREL=16.0 PREFIX=%D LOCALBASE=/usr/local RESETPREFIX=/usr/local LIB32DIR=lib DOCSDIR="share/doc/appstream-generator" EXAMPLESDIR="share/examples/appstream-generator" DATADIR="share/appstream" WWWDIR="www/appstream-generator" ETCDIR="etc/appstream-generator"
--End PLIST_SUB--
--SUB_LIST--
MANPAGES="@comment " NO_MANPAGES="" PREFIX=/usr/local LOCALBASE=/usr/local DATADIR=/usr/local/share/appstream DOCSDIR=/usr/local/share/doc/appstream-generator EXAMPLESDIR=/usr/local/share/examples/appstream-generator WWWDIR=/usr/local/www/appstream-generator ETCDIR=/usr/local/etc/appstream-generator
--End SUB_LIST--
---Begin make.conf---
USE_PACKAGE_DEPENDS=yes
BATCH=yes
WRKDIRPREFIX=/wrkdirs
PORTSDIR=/usr/ports
PACKAGES=/packages
DISTDIR=/distfiles
PACKAGE_BUILDING=yes
PACKAGE_BUILDING_FLAVORS=yes
#### ####
# XXX: We really need this but cannot use it while 'make checksum' does not
# try the next mirror on checksum failure. It currently retries the same
# failed mirror and then fails rather then trying another. It *does*
# try the next if the size is mismatched though.
#MASTER_SITE_FREEBSD=yes
# Build ALLOW_MAKE_JOBS_PACKAGES with 3 jobs
MAKE_JOBS_NUMBER=3
#### Misc Poudriere ####
.include "/etc/make.conf.ports_env"
GID=0
UID=0
---End make.conf---
--Resource limits--
cpu time (seconds, -t) unlimited
file size (512-blocks, -f) unlimited
data seg size (kbytes, -d) 1048576
stack size (kbytes, -s) 1048576
core file size (512-blocks, -c) unlimited
max memory size (kbytes, -m) unlimited
locked memory (kbytes, -l) unlimited
max user processes (-u) 89999
open files (-n) 8192
virtual mem size (kbytes, -v) unlimited
swap limit (kbytes, -w) unlimited
socket buffer size (bytes, -b) unlimited
pseudo-terminals (-p) unlimited
kqueues (-k) unlimited
umtx shared locks (-o) unlimited
pipebuf (kbytes, -y) unlimited
virtual machines (-V) unlimited
--End resource limits--
=======================<phase: check-sanity >============================
===== env: NO_DEPENDS=yes USER=root UID=0 GID=0
===> License LGPL3 accepted by the user
===========================================================================
=======================<phase: pkg-depends >============================
===== env: USE_PACKAGE_DEPENDS_ONLY=1 USER=root UID=0 GID=0
===> appstream-generator-1.0.0 depends on file: /usr/local/sbin/pkg - not found
===> Installing existing package /packages/All/pkg-2.8.4.pkg
[main-arm64-default-job-01] Installing pkg-2.8.4...
[main-arm64-default-job-01] Extracting pkg-2.8.4: .......... done
===> appstream-generator-1.0.0 depends on file: /usr/local/sbin/pkg - found
===> Returning to build of appstream-generator-1.0.0
===========================================================================
=======================<phase: fetch-depends >============================
===== env: USE_PACKAGE_DEPENDS_ONLY=1 USER=root UID=0 GID=0
===========================================================================
=======================<phase: fetch >============================
===== env: NO_DEPENDS=yes USER=root UID=0 GID=0
===> License LGPL3 accepted by the user
=> ximion-appstream-generator-v1.0.0_GH0.tar.gz doesn't seem to exist in /portdistfiles.
=> Attempting to fetch https://codeload.github.com/ximion/appstream-generator/tar.gz/v1.0.0?dummy=/ximion-appstream-generator-v1.0.0_GH0.tar.gz
fetch: https://codeload.github.com/ximion/appstream-generator/tar.gz/v1.0.0?dummy=/ximion-appstream-generator-v1.0.0_GH0.tar.gz: size unknown
fetch: https://codeload.github.com/ximion/appstream-generator/tar.gz/v1.0.0?dummy=/ximion-appstream-generator-v1.0.0_GH0.tar.gz: size of remote file is not known
ximion-appstream-generator-v1.0.0_GH0.tar.gz 708 kB 12 MBps 00s
===> Fetching all distfiles required by appstream-generator-1.0.0 for building
===========================================================================
=======================<phase: checksum >============================
===== env: NO_DEPENDS=yes USER=root UID=0 GID=0
===> License LGPL3 accepted by the user
===> Fetching all distfiles required by appstream-generator-1.0.0 for building
=> SHA256 Checksum OK for ximion-appstream-generator-v1.0.0_GH0.tar.gz.
===========================================================================
=======================<phase: extract-depends>============================
===== env: USE_PACKAGE_DEPENDS_ONLY=1 USER=root UID=0 GID=0
===========================================================================
=======================<phase: extract >============================
===== env: NO_DEPENDS=yes USER=root UID=0 GID=0
===> License LGPL3 accepted by the user
===> Fetching all distfiles required by appstream-generator-1.0.0 for building
===> Extracting for appstream-generator-1.0.0
=> SHA256 Checksum OK for ximion-appstream-generator-v1.0.0_GH0.tar.gz.
===========================================================================
=======================<phase: patch-depends >============================
===== env: USE_PACKAGE_DEPENDS_ONLY=1 USER=root UID=0 GID=0
===========================================================================
=======================<phase: patch >============================
===== env: NO_DEPENDS=yes USER=root UID=0 GID=0
===> Patching for appstream-generator-1.0.0
===> Applying FreeBSD patches for appstream-generator-1.0.0 from /usr/ports/ports-mgmt/appstream-generator/files
===========================================================================
=======================<phase: build-depends >============================
===== env: USE_PACKAGE_DEPENDS_ONLY=1 USER=root UID=0 GID=0
===> appstream-generator-1.0.0 depends on package: nlohmann-json>=3 - not found
===> Installing existing package /packages/All/nlohmann-json-3.12.0_1.pkg
[main-arm64-default-job-01] Installing nlohmann-json-3.12.0_1...
[main-arm64-default-job-01] Extracting nlohmann-json-3.12.0_1: .......... done
===> appstream-generator-1.0.0 depends on package: nlohmann-json>=3 - found
===> Returning to build of appstream-generator-1.0.0
<snip>
Don't forget to add -pthread to your linker options when
linking your code.
=====
Message from gcc14-14.2.0_7:
--
To ensure binaries built with this toolchain find appropriate versions
of the necessary run-time libraries, you may want to link using
-Wl,-rpath=/usr/local/lib/gcc14
For ports leveraging USE_GCC, USES=compiler, or USES=fortran this happens
transparently.
=====
Message from libjxl-0.12.0:
--
Additional packages recommended for new users:
- imlib2-jxl (e.g., feh, scrot)
- kf5-kimageformats (e.g., nomacs, flameshot, skanlite)
- gimp-jxl-plugin
=====
Message from ghostscript10-10.07.1:
--
This package installs a script named dvipdf that depends on dvips. If you
want to use this script you need to install print/tex-dvipsk.
=====
Message from gsfonts-8.11_8:
--
===> NOTICE:
The gsfonts port currently does not have a maintainer. As a result, it is
more likely to have unresolved issues, not be up-to-date, or even be removed in
the future. To volunteer to maintain this port, please create an issue at:
https://bugs.freebsd.org/bugzilla
More information about port maintainership is available at:
https://docs.freebsd.org/en/articles/contributing/#ports-contributing
=====
Message from libxkbcommon-1.13.2:
--
If arrow keys don't work under X11 switch to legacy rules e.g.,
For sh/bash/ksh/zsh run and (optionally) add into ~/.profile:
export XKB_DEFAULT_RULES=xorg
For csh/tcsh run and (optionally) add into ~/.login:
setenv XKB_DEFAULT_RULES xorg
=====
Message from liblqr-1-0.4.2:
--
NOTE: In order to compile examples for liblqr, you will
also need pngwriter port (/usr/ports/graphics/pngwriter).
Examples are located in /usr/local/share/examples/liblqr-1
=====
Message from libraqm-0.11.0:
--
===> NOTICE:
The libraqm port currently does not have a maintainer. As a result, it is
more likely to have unresolved issues, not be up-to-date, or even be removed in
the future. To volunteer to maintain this port, please create an issue at:
https://bugs.freebsd.org/bugzilla
More information about port maintainership is available at:
https://docs.freebsd.org/en/articles/contributing/#ports-contributing
===> appstream-generator-1.0.0 depends on shared library: libappstream-compose.so - found (/usr/local/lib/libappstream-compose.so)
===> Returning to build of appstream-generator-1.0.0
===> appstream-generator-1.0.0 depends on shared library: libCatch2.so - found (/usr/local/lib/libCatch2.so)
===> appstream-generator-1.0.0 depends on shared library: libcurl.so - found (/usr/local/lib/libcurl.so)
===> appstream-generator-1.0.0 depends on shared library: liblmdb.so - not found
===> Installing existing package /packages/All/lmdb0-0.9.35.pkg
[main-arm64-default-job-01] Installing lmdb0-0.9.35...
[main-arm64-default-job-01] Extracting lmdb0-0.9.35: .......... done
===> appstream-generator-1.0.0 depends on shared library: liblmdb.so - found (/usr/local/lib/liblmdb.so)
===> Returning to build of appstream-generator-1.0.0
===> appstream-generator-1.0.0 depends on shared library: libicuuc.so - found (/usr/local/lib/libicuuc.so)
===> appstream-generator-1.0.0 depends on shared library: libtbb.so - not found
===> Installing existing package /packages/All/onetbb-2023.1.0.pkg
[main-arm64-default-job-01] Installing onetbb-2023.1.0...
[main-arm64-default-job-01] `-- Installing hwloc2-2.12.1_1...
[main-arm64-default-job-01] | `-- Installing level-zero-1.32.0...
[main-arm64-default-job-01] | `-- Extracting level-zero-1.32.0: .......... done
[main-arm64-default-job-01] `-- Extracting hwloc2-2.12.1_1: .......... done
[main-arm64-default-job-01] Extracting onetbb-2023.1.0: .......... done
===> appstream-generator-1.0.0 depends on shared library: libtbb.so - found (/usr/local/lib/libtbb.so)
===> Returning to build of appstream-generator-1.0.0
===> appstream-generator-1.0.0 depends on shared library: libfyaml.so - found (/usr/local/lib/libfyaml.so)
===> appstream-generator-1.0.0 depends on shared library: libglib-2.0.so - found (/usr/local/lib/libglib-2.0.so)
===> appstream-generator-1.0.0 depends on shared library: libintl.so - found (/usr/local/lib/libintl.so)
===> appstream-generator-1.0.0 depends on shared library: libxml2.so - found (/usr/local/lib/libxml2.so)
===> appstream-generator-1.0.0 depends on shared library: libarchive.so.13 - found (/usr/local/lib/libarchive.so.13)
===========================================================================
=======================<phase: configure >============================
===== env: NO_DEPENDS=yes USER=root UID=0 GID=0
===> Configuring for appstream-generator-1.0.0
The Meson build system
Version: 1.10.2
Source dir: /wrkdirs/usr/ports/ports-mgmt/appstream-generator/work/appstream-generator-1.0.0
Build dir: /wrkdirs/usr/ports/ports-mgmt/appstream-generator/work/appstream-generator-1.0.0/_build
Build type: native build
Project name: AppStream Generator
Project version: 1.0.0
C++ compiler for the host machine: c++ (clang 21.1.8 "FreeBSD clang version 21.1.8 (https://github.com/llvm/llvm-project.git llvmorg-21.1.8-0-g2078da43e25a)")
C++ linker for the host machine: c++ ld.lld 21.1.8
Host machine cpu family: aarch64
Host machine cpu: aarch64
Found pkg-config: YES (/usr/bin/pkgconf) 2.9.93
Run-time dependency glib-2.0 found: YES 2.88.3
Run-time dependency appstream found: YES 1.2.0
Run-time dependency appstream-compose found: YES 1.2.0
Run-time dependency lmdb found: YES 0.9.35
Run-time dependency libarchive found: YES 3.8.8
Run-time dependency libcurl found: YES 8.22.0
Run-time dependency libfyaml found: YES 0.9.6
Run-time dependency tbb found: YES 2023.1.0
Run-time dependency icu-uc found: YES 76.1
Run-time dependency libxml-2.0 found: YES 2.15.4
Run-time dependency catch2-with-main found: YES 3.15.3
Run-time dependency nlohmann_json found: YES 3.12.0
Run-time dependency quill found: YES 11.1.0
Run-time dependency inja found: YES 3.5.0
Compiler for C++ supports arguments -Werror=empty-body: YES
Compiler for C++ supports arguments -Werror=pointer-arith: YES
Compiler for C++ supports arguments -Werror=missing-declarations: YES
Compiler for C++ supports arguments -Werror=return-type: YES
Compiler for C++ supports arguments -Werror=misleading-indentation: YES
Compiler for C++ supports arguments -Werror=format-security: YES
Compiler for C++ supports arguments -Werror=suggest-override: YES
Compiler for C++ supports arguments -Wno-missing-field-initializers: YES
Compiler for C++ supports arguments -Wno-error=missing-field-initializers: YES
Compiler for C++ supports arguments -Wno-unused-parameter: YES
Compiler for C++ supports arguments -Wno-error=unused-parameter: YES
Configuring defines.h using configuration
Program appstreamcli found: YES (/usr/local/bin/appstreamcli)
Program xsltproc found: YES (/usr/local/bin/xsltproc)
Build targets in project: 13
AppStream Generator 1.0.0
User defined options
auto_features : enabled
b_colorout : never
backward : false
buildtype : release
infodir : share/info
localstatedir : /var
optimization : plain
prefix : /usr/local
python.bytecompile: -1
strip : true
Found ninja-1.13.2 at /usr/local/bin/ninja
===========================================================================
=======================<phase: build >============================
===== env: NO_DEPENDS=yes USER=root UID=0 GID=0
===> Building for appstream-generator-1.0.0
[ 1% 3/70] c++ -Isrc/libasgenlib.a.p -Isrc -I../src -I/usr/local/include/glib-2.0 -I/usr/local/lib/glib-2.0/include -I/usr/local/include -I/usr/local/include/appstream -I/usr/local/include/libxmlb-2 -I/usr/local/include/libxml2 -I/usr/local/include/libepoll-shim -I/usr/local/include/appstream-compose -I/usr/local/include/gio-unix-2.0 -fdiagnostics-color=never -D_LIBCPP_HARDENING_MODE=_LIBCPP_HARDENING_MODE_FAST -D_FILE_OFFSET_BITS=64 -Wall -Winvalid-pch -std=c++23 -fexperimental-library -Werror=empty-body -Werror=pointer-arith -Werror=missing-declarations -Werror=return-type -Werror=misleading-indentation -Werror=format-security -Werror=suggest-override -Wno-missing-field-initializers -Wno-error=missing-field-initializers -Wno-unused-parameter -Wno-error=unused-parameter -O2 -pipe -fexperimental-library -fstack-protector-strong -isystem /usr/local/include -fno-strict-aliasing -isystem /usr/local/include -std=c++23 -isystem /usr/local/include -fPIC -isystem/usr/local/include
-pthread -DBLAKE3_DLL -D_THREAD_SAFE -MD -MQ src/libasgenlib.a.p/cptmodifiers.cpp.o -MF src/libasgenlib.a.p/cptmodifiers.cpp.o.d -o src/libasgenlib.a.p/cptmodifiers.cpp.o -c ../src/cptmodifiers.cpp
[ 2% 4/70] c++ -Isrc/libasgenlib.a.p -Isrc -I../src -I/usr/local/include/glib-2.0 -I/usr/local/lib/glib-2.0/include -I/usr/local/include -I/usr/local/include/appstream -I/usr/local/include/libxmlb-2 -I/usr/local/include/libxml2 -I/usr/local/include/libepoll-shim -I/usr/local/include/appstream-compose -I/usr/local/include/gio-unix-2.0 -fdiagnostics-color=never -D_LIBCPP_HARDENING_MODE=_LIBCPP_HARDENING_MODE_FAST -D_FILE_OFFSET_BITS=64 -Wall -Winvalid-pch -std=c++23 -fexperimental-library -Werror=empty-body -Werror=pointer-arith -Werror=missing-declarations -Werror=return-type -Werror=misleading-indentation -Werror=format-security -Werror=suggest-override -Wno-missing-field-initializers -Wno-error=missing-field-initializers -Wno-unused-parameter -Wno-error=unused-parameter -O2 -pipe -fexperimental-library -fstack-protector-strong -isystem /usr/local/include -fno-strict-aliasing -isystem /usr/local/include -std=c++23 -isystem /usr/local/include -fPIC -isystem/usr/local/include
-pthread -DBLAKE3_DLL -D_THREAD_SAFE -MD -MQ src/libasgenlib.a.p/contentsstore.cpp.o -MF src/libasgenlib.a.p/contentsstore.cpp.o.d -o src/libasgenlib.a.p/contentsstore.cpp.o -c ../src/contentsstore.cpp
[ 4% 5/70] c++ -Isrc/libasgenlib.a.p -Isrc -I../src -I/usr/local/include/glib-2.0 -I/usr/local/lib/glib-2.0/include -I/usr/local/include -I/usr/local/include/appstream -I/usr/local/include/libxmlb-2 -I/usr/local/include/libxml2 -I/usr/local/include/libepoll-shim -I/usr/local/include/appstream-compose -I/usr/local/include/gio-unix-2.0 -fdiagnostics-color=never -D_LIBCPP_HARDENING_MODE=_LIBCPP_HARDENING_MODE_FAST -D_FILE_OFFSET_BITS=64 -Wall -Winvalid-pch -std=c++23 -fexperimental-library -Werror=empty-body -Werror=pointer-arith -Werror=missing-declarations -Werror=return-type -Werror=misleading-indentation -Werror=format-security -Werror=suggest-override -Wno-missing-field-initializers -Wno-error=missing-field-initializers -Wno-unused-parameter -Wno-error=unused-parameter -O2 -pipe -fexperimental-library -fstack-protector-strong -isystem /usr/local/include -fno-strict-aliasing -isystem /usr/local/include -std=c++23 -isystem /usr/local/include -fPIC -isystem/usr/local/include
-pthread -DBLAKE3_DLL -D_THREAD_SAFE -MD -MQ src/libasgenlib.a.p/config.cpp.o -MF src/libasgenlib.a.p/config.cpp.o.d -o src/libasgenlib.a.p/config.cpp.o -c ../src/config.cpp
[ 5% 6/70] c++ -Isrc/libasgenlib.a.p -Isrc -I../src -I/usr/local/include/glib-2.0 -I/usr/local/lib/glib-2.0/include -I/usr/local/include -I/usr/local/include/appstream -I/usr/local/include/libxmlb-2 -I/usr/local/include/libxml2 -I/usr/local/include/libepoll-shim -I/usr/local/include/appstream-compose -I/usr/local/include/gio-unix-2.0 -fdiagnostics-color=never -D_LIBCPP_HARDENING_MODE=_LIBCPP_HARDENING_MODE_FAST -D_FILE_OFFSET_BITS=64 -Wall -Winvalid-pch -std=c++23 -fexperimental-library -Werror=empty-body -Werror=pointer-arith -Werror=missing-declarations -Werror=return-type -Werror=misleading-indentation -Werror=format-security -Werror=suggest-override -Wno-missing-field-initializers -Wno-error=missing-field-initializers -Wno-unused-parameter -Wno-error=unused-parameter -O2 -pipe -fexperimental-library -fstack-protector-strong -isystem /usr/local/include -fno-strict-aliasing -isystem /usr/local/include -std=c++23 -isystem /usr/local/include -fPIC -isystem/usr/local/include
-pthread -DBLAKE3_DLL -D_THREAD_SAFE -MD -MQ src/libasgenlib.a.p/dataunits.cpp.o -MF src/libasgenlib.a.p/dataunits.cpp.o.d -o src/libasgenlib.a.p/dataunits.cpp.o -c ../src/dataunits.cpp
[ 7% 7/70] c++ -Isrc/libasgenlib.a.p -Isrc -I../src -I/usr/local/include/glib-2.0 -I/usr/local/lib/glib-2.0/include -I/usr/local/include -I/usr/local/include/appstream -I/usr/local/include/libxmlb-2 -I/usr/local/include/libxml2 -I/usr/local/include/libepoll-shim -I/usr/local/include/appstream-compose -I/usr/local/include/gio-unix-2.0 -fdiagnostics-color=never -D_LIBCPP_HARDENING_MODE=_LIBCPP_HARDENING_MODE_FAST -D_FILE_OFFSET_BITS=64 -Wall -Winvalid-pch -std=c++23 -fexperimental-library -Werror=empty-body -Werror=pointer-arith -Werror=missing-declarations -Werror=return-type -Werror=misleading-indentation -Werror=format-security -Werror=suggest-override -Wno-missing-field-initializers -Wno-error=missing-field-initializers -Wno-unused-parameter -Wno-error=unused-parameter -O2 -pipe -fexperimental-library -fstack-protector-strong -isystem /usr/local/include -fno-strict-aliasing -isystem /usr/local/include -std=c++23 -isystem /usr/local/include -fPIC -isystem/usr/local/include
-pthread -DBLAKE3_DLL -D_THREAD_SAFE -MD -MQ src/libasgenlib.a.p/datainjectpkg.cpp.o -MF src/libasgenlib.a.p/datainjectpkg.cpp.o.d -o src/libasgenlib.a.p/datainjectpkg.cpp.o -c ../src/datainjectpkg.cpp
[ 8% 8/70] c++ -Isrc/libasgenlib.a.p -Isrc -I../src -I/usr/local/include/glib-2.0 -I/usr/local/lib/glib-2.0/include -I/usr/local/include -I/usr/local/include/appstream -I/usr/local/include/libxmlb-2 -I/usr/local/include/libxml2 -I/usr/local/include/libepoll-shim -I/usr/local/include/appstream-compose -I/usr/local/include/gio-unix-2.0 -fdiagnostics-color=never -D_LIBCPP_HARDENING_MODE=_LIBCPP_HARDENING_MODE_FAST -D_FILE_OFFSET_BITS=64 -Wall -Winvalid-pch -std=c++23 -fexperimental-library -Werror=empty-body -Werror=pointer-arith -Werror=missing-declarations -Werror=return-type -Werror=misleading-indentation -Werror=format-security -Werror=suggest-override -Wno-missing-field-initializers -Wno-error=missing-field-initializers -Wno-unused-parameter -Wno-error=unused-parameter -O2 -pipe -fexperimental-library -fstack-protector-strong -isystem /usr/local/include -fno-strict-aliasing -isystem /usr/local/include -std=c++23 -isystem /usr/local/include -fPIC -isystem/usr/local/include
-pthread -DBLAKE3_DLL -D_THREAD_SAFE -MD -MQ src/libasgenlib.a.p/downloader.cpp.o -MF src/libasgenlib.a.p/downloader.cpp.o.d -o src/libasgenlib.a.p/downloader.cpp.o -c ../src/downloader.cpp
[ 10% 9/70] c++ -Isrc/libasgenlib.a.p -Isrc -I../src -I/usr/local/include/glib-2.0 -I/usr/local/lib/glib-2.0/include -I/usr/local/include -I/usr/local/include/appstream -I/usr/local/include/libxmlb-2 -I/usr/local/include/libxml2 -I/usr/local/include/libepoll-shim -I/usr/local/include/appstream-compose -I/usr/local/include/gio-unix-2.0 -fdiagnostics-color=never -D_LIBCPP_HARDENING_MODE=_LIBCPP_HARDENING_MODE_FAST -D_FILE_OFFSET_BITS=64 -Wall -Winvalid-pch -std=c++23 -fexperimental-library -Werror=empty-body -Werror=pointer-arith -Werror=missing-declarations -Werror=return-type -Werror=misleading-indentation -Werror=format-security -Werror=suggest-override -Wno-missing-field-initializers -Wno-error=missing-field-initializers -Wno-unused-parameter -Wno-error=unused-parameter -O2 -pipe -fexperimental-library -fstack-protector-strong -isystem /usr/local/include -fno-strict-aliasing -isystem /usr/local/include -std=c++23 -isystem /usr/local/include -fPIC -isystem/usr/local/include
-pthread -DBLAKE3_DLL -D_THREAD_SAFE -MD -MQ src/libasgenlib.a.p/datastore.cpp.o -MF src/libasgenlib.a.p/datastore.cpp.o.d -o src/libasgenlib.a.p/datastore.cpp.o -c ../src/datastore.cpp
[ 11% 10/70] c++ -Isrc/libasgenlib.a.p -Isrc -I../src -I/usr/local/include/glib-2.0 -I/usr/local/lib/glib-2.0/include -I/usr/local/include -I/usr/local/include/appstream -I/usr/local/include/libxmlb-2 -I/usr/local/include/libxml2 -I/usr/local/include/libepoll-shim -I/usr/local/include/appstream-compose -I/usr/local/include/gio-unix-2.0 -fdiagnostics-color=never -D_LIBCPP_HARDENING_MODE=_LIBCPP_HARDENING_MODE_FAST -D_FILE_OFFSET_BITS=64 -Wall -Winvalid-pch -std=c++23 -fexperimental-library -Werror=empty-body -Werror=pointer-arith -Werror=missing-declarations -Werror=return-type -Werror=misleading-indentation -Werror=format-security -Werror=suggest-override -Wno-missing-field-initializers -Wno-error=missing-field-initializers -Wno-unused-parameter -Wno-error=unused-parameter -O2 -pipe -fexperimental-library -fstack-protector-strong -isystem /usr/local/include -fno-strict-aliasing -isystem /usr/local/include -std=c++23 -isystem /usr/local/include -fPIC -isystem/usr/local/includ
e -pthread -DBLAKE3_DLL -D_THREAD_SAFE -MD -MQ src/libasgenlib.a.p/hintregistry.cpp.o -MF src/libasgenlib.a.p/hintregistry.cpp.o.d -o src/libasgenlib.a.p/hintregistry.cpp.o -c ../src/hintregistry.cpp
[ 12% 11/70] c++ -Isrc/libasgenlib.a.p -Isrc -I../src -I/usr/local/include/glib-2.0 -I/usr/local/lib/glib-2.0/include -I/usr/local/include -I/usr/local/include/appstream -I/usr/local/include/libxmlb-2 -I/usr/local/include/libxml2 -I/usr/local/include/libepoll-shim -I/usr/local/include/appstream-compose -I/usr/local/include/gio-unix-2.0 -fdiagnostics-color=never -D_LIBCPP_HARDENING_MODE=_LIBCPP_HARDENING_MODE_FAST -D_FILE_OFFSET_BITS=64 -Wall -Winvalid-pch -std=c++23 -fexperimental-library -Werror=empty-body -Werror=pointer-arith -Werror=missing-declarations -Werror=return-type -Werror=misleading-indentation -Werror=format-security -Werror=suggest-override -Wno-missing-field-initializers -Wno-error=missing-field-initializers -Wno-unused-parameter -Wno-error=unused-parameter -O2 -pipe -fexperimental-library -fstack-protector-strong -isystem /usr/local/include -fno-strict-aliasing -isystem /usr/local/include -std=c++23 -isystem /usr/local/include -fPIC -isystem/usr/local/includ
e -pthread -DBLAKE3_DLL -D_THREAD_SAFE -MD -MQ src/libasgenlib.a.p/extractor.cpp.o -MF src/libasgenlib.a.p/extractor.cpp.o.d -o src/libasgenlib.a.p/extractor.cpp.o -c ../src/extractor.cpp
[ 14% 12/70] c++ -Isrc/libasgenlib.a.p -Isrc -I../src -I/usr/local/include/glib-2.0 -I/usr/local/lib/glib-2.0/include -I/usr/local/include -I/usr/local/include/appstream -I/usr/local/include/libxmlb-2 -I/usr/local/include/libxml2 -I/usr/local/include/libepoll-shim -I/usr/local/include/appstream-compose -I/usr/local/include/gio-unix-2.0 -fdiagnostics-color=never -D_LIBCPP_HARDENING_MODE=_LIBCPP_HARDENING_MODE_FAST -D_FILE_OFFSET_BITS=64 -Wall -Winvalid-pch -std=c++23 -fexperimental-library -Werror=empty-body -Werror=pointer-arith -Werror=missing-declarations -Werror=return-type -Werror=misleading-indentation -Werror=format-security -Werror=suggest-override -Wno-missing-field-initializers -Wno-error=missing-field-initializers -Wno-unused-parameter -Wno-error=unused-parameter -O2 -pipe -fexperimental-library -fstack-protector-strong -isystem /usr/local/include -fno-strict-aliasing -isystem /usr/local/include -std=c++23 -isystem /usr/local/include -fPIC -isystem/usr/local/includ
e -pthread -DBLAKE3_DLL -D_THREAD_SAFE -MD -MQ src/libasgenlib.a.p/logging.cpp.o -MF src/libasgenlib.a.p/logging.cpp.o.d -o src/libasgenlib.a.p/logging.cpp.o -c ../src/logging.cpp
FAILED: [code=1] src/libasgenlib.a.p/logging.cpp.o
c++ -Isrc/libasgenlib.a.p -Isrc -I../src -I/usr/local/include/glib-2.0 -I/usr/local/lib/glib-2.0/include -I/usr/local/include -I/usr/local/include/appstream -I/usr/local/include/libxmlb-2 -I/usr/local/include/libxml2 -I/usr/local/include/libepoll-shim -I/usr/local/include/appstream-compose -I/usr/local/include/gio-unix-2.0 -fdiagnostics-color=never -D_LIBCPP_HARDENING_MODE=_LIBCPP_HARDENING_MODE_FAST -D_FILE_OFFSET_BITS=64 -Wall -Winvalid-pch -std=c++23 -fexperimental-library -Werror=empty-body -Werror=pointer-arith -Werror=missing-declarations -Werror=return-type -Werror=misleading-indentation -Werror=format-security -Werror=suggest-override -Wno-missing-field-initializers -Wno-error=missing-field-initializers -Wno-unused-parameter -Wno-error=unused-parameter -O2 -pipe -fexperimental-library -fstack-protector-strong -isystem /usr/local/include -fno-strict-aliasing -isystem /usr/local/include -std=c++23 -isystem /usr/local/include -fPIC -isystem/usr/local/include -pthread -D
BLAKE3_DLL -D_THREAD_SAFE -MD -MQ src/libasgenlib.a.p/logging.cpp.o -MF src/libasgenlib.a.p/logging.cpp.o.d -o src/libasgenlib.a.p/logging.cpp.o -c ../src/logging.cpp
In file included from ../src/logging.cpp:23:
In file included from /usr/local/include/quill/Backend.h:9:
In file included from /usr/local/include/quill/backend/BackendManager.h:10:
In file included from /usr/local/include/quill/backend/BackendWorker.h:14:
/usr/local/include/quill/backend/BackendUtilities.h:97:43: error: use of undeclared identifier 'pthread_self'
97 | auto const err = pthread_setaffinity_np(pthread_self(), sizeof(cpuset_t), &cpuset);
| ^~~~~~~~~~~~
/usr/local/include/quill/backend/BackendUtilities.h:150:23: error: use of undeclared identifier 'pthread_self'
150 | pthread_set_name_np(pthread_self(), truncated_name);
| ^~~~~~~~~~~~
2 errors generated.
[ 15% 12/70] c++ -Isrc/libasgenlib.a.p -Isrc -I../src -I/usr/local/include/glib-2.0 -I/usr/local/lib/glib-2.0/include -I/usr/local/include -I/usr/local/include/appstream -I/usr/local/include/libxmlb-2 -I/usr/local/include/libxml2 -I/usr/local/include/libepoll-shim -I/usr/local/include/appstream-compose -I/usr/local/include/gio-unix-2.0 -fdiagnostics-color=never -D_LIBCPP_HARDENING_MODE=_LIBCPP_HARDENING_MODE_FAST -D_FILE_OFFSET_BITS=64 -Wall -Winvalid-pch -std=c++23 -fexperimental-library -Werror=empty-body -Werror=pointer-arith -Werror=missing-declarations -Werror=return-type -Werror=misleading-indentation -Werror=format-security -Werror=suggest-override -Wno-missing-field-initializers -Wno-error=missing-field-initializers -Wno-unused-parameter -Wno-error=unused-parameter -O2 -pipe -fexperimental-library -fstack-protector-strong -isystem /usr/local/include -fno-strict-aliasing -isystem /usr/local/include -std=c++23 -isystem /usr/local/include -fPIC -isystem/usr/local/includ
e -pthread -DBLAKE3_DLL -D_THREAD_SAFE -MD -MQ src/libasgenlib.a.p/iconhandler.cpp.o -MF src/libasgenlib.a.p/iconhandler.cpp.o.d -o src/libasgenlib.a.p/iconhandler.cpp.o -c ../src/iconhandler.cpp
[ 17% 12/70] c++ -Isrc/libasgenlib.a.p -Isrc -I../src -I/usr/local/include/glib-2.0 -I/usr/local/lib/glib-2.0/include -I/usr/local/include -I/usr/local/include/appstream -I/usr/local/include/libxmlb-2 -I/usr/local/include/libxml2 -I/usr/local/include/libepoll-shim -I/usr/local/include/appstream-compose -I/usr/local/include/gio-unix-2.0 -fdiagnostics-color=never -D_LIBCPP_HARDENING_MODE=_LIBCPP_HARDENING_MODE_FAST -D_FILE_OFFSET_BITS=64 -Wall -Winvalid-pch -std=c++23 -fexperimental-library -Werror=empty-body -Werror=pointer-arith -Werror=missing-declarations -Werror=return-type -Werror=misleading-indentation -Werror=format-security -Werror=suggest-override -Wno-missing-field-initializers -Wno-error=missing-field-initializers -Wno-unused-parameter -Wno-error=unused-parameter -O2 -pipe -fexperimental-library -fstack-protector-strong -isystem /usr/local/include -fno-strict-aliasing -isystem /usr/local/include -std=c++23 -isystem /usr/local/include -fPIC -isystem/usr/local/includ
e -pthread -DBLAKE3_DLL -D_THREAD_SAFE -MD -MQ src/libasgenlib.a.p/engine.cpp.o -MF src/libasgenlib.a.p/engine.cpp.o.d -o src/libasgenlib.a.p/engine.cpp.o -c ../src/engine.cpp
ninja: build stopped: subcommand failed.
===> Compilation failed unexpectedly.
Try to set MAKE_JOBS_UNSAFE=yes and rebuild before reporting the failure to
the maintainer.
*** Error code 1
Stop.
make: stopped making "build" in /usr/ports/ports-mgmt/appstream-generator